null
SMILES: COc1cc2CCC(c2c(OC)c1OC)c1cccc(Br)c(=O)c1
InChI Key: InChIKey=BOZGJNALOLSZHH-UHFFFAOYSA-N
Activity Spreadsheet -- Enzyme Inhibition Constant Data from BindingDB
Found 3 hits for monomerid = 50217337
Trg + Lig
Ki
nM
ΔG°
kcal/mole
IC50
nM
Kd
nM
EC50/IC50
nM
koff
s-1
kon
M-1s-1
pHTemp
°C
Similar to alpha-tubulin isoform 1
(Bos taurus)
BDBM50217337
(CHEMBL130312)
Show SMILES COc1cc2CCC(c2c(OC)c1OC)c1cccc(Br)c(=O)c1
Show InChI InChI=1S/C19H19BrO4/c1-22-16-10-12-7-8-13(17(12)19(24-3)18(16)23-2)11-5-4-6-14(20)15(21)9-11/h4-6,9-10,13H,7-8H2,1-3H3
n/an/a 3.20E+4n/an/an/an/an/an/a
University of Virginia
Curated by ChEMBL
Assay Description
Inhibition of tubulin polymerization activity using homogenous bovine brain tubulin at 30 degree C
Bioorg Med Chem Lett 9: 407-12 (1999)
BindingDB Entry DOI: 10.7270/Q2BG2R5N
Similar to alpha-tubulin isoform 1
(Bos taurus)
BDBM50217337
(CHEMBL130312)
Show SMILES COc1cc2CCC(c2c(OC)c1OC)c1cccc(Br)c(=O)c1
Show InChI InChI=1S/C19H19BrO4/c1-22-16-10-12-7-8-13(17(12)19(24-3)18(16)23-2)11-5-4-6-14(20)15(21)9-11/h4-6,9-10,13H,7-8H2,1-3H3
n/an/a 2.81E+4n/an/an/an/an/an/a
University of Virginia
Curated by ChEMBL
Assay Description
Inhibition of tubulin polymerization activity using homogenous bovine brain tubulin at 37 degree C
Bioorg Med Chem Lett 9: 407-12 (1999)
BindingDB Entry DOI: 10.7270/Q2BG2R5N
Similar to alpha-tubulin isoform 1
(Bos taurus)
BDBM50217337
(CHEMBL130312)
Show SMILES COc1cc2CCC(c2c(OC)c1OC)c1cccc(Br)c(=O)c1
Show InChI InChI=1S/C19H19BrO4/c1-22-16-10-12-7-8-13(17(12)19(24-3)18(16)23-2)11-5-4-6-14(20)15(21)9-11/h4-6,9-10,13H,7-8H2,1-3H3
n/an/a 2.20E+4n/an/an/an/an/an/a
University of Virginia
Curated by ChEMBL
Assay Description
Inhibition of tubulin polymerization activity using homogenous bovine brain tubulin at 45 degree C
Bioorg Med Chem Lett 9: 407-12 (1999)
BindingDB Entry DOI: 10.7270/Q2BG2R5N