null
SMILES: COc1ccnc(NC[C@@H]2C[C@H](CN2C(=O)OCc2ccccc2)OCC(=O)NC[C@H](NS(=O)(=O)c2c(C)cc(C)cc2C)C(O)=O)c1
InChI Key: InChIKey=CGSLGBRMSMBNMX-ITHJLQSDSA-N
Activity Spreadsheet -- Enzyme Inhibition Constant Data from BindingDB
Found 4 hits for monomerid = 50217435
Trg + Lig
Ki
nM
ΔG°
kcal/mole
IC50
nM
Kd
nM
EC50/IC50
nM
koff
s-1
kon
M-1s-1
pHTemp
°C
Integrin alpha-V/beta-5
(Homo sapiens (Human))
BDBM50217435
(2S,4R,20S-4-{[2-carboxy-2-(2,4,6-trimethyl-benzene...)
Show SMILES COc1ccnc(NC[C@@H]2C[C@H](CN2C(=O)OCc2ccccc2)OCC(=O)NC[C@H](NS(=O)(=O)c2c(C)cc(C)cc2C)C(O)=O)c1
Show InChI InChI=1S/C33H41N5O9S/c1-21-12-22(2)31(23(3)13-21)48(43,44)37-28(32(40)41)17-36-30(39)20-46-27-14-25(16-35-29-15-26(45-4)10-11-34-29)38(18-27)33(42)47-19-24-8-6-5-7-9-24/h5-13,15,25,27-28,37H,14,16-20H2,1-4H3,(H,34,35)(H,36,39)(H,40,41)/t25-,27+,28-/m0/s1
NCI pathway
Reactome pathway
n/an/a 19n/an/an/an/an/an/a
Jerini AG
Curated by ChEMBL
Assay Description
Inhibition of integrin alphaVbeta5 receptor by ELISA
J Med Chem 50: 3786-94 (2007)
Article DOI: 10.1021/jm070002v
BindingDB Entry DOI: 10.7270/Q2PG1RFZ
Integrin alpha-V/beta-3
(Homo sapiens (Human))
BDBM50217435
(2S,4R,20S-4-{[2-carboxy-2-(2,4,6-trimethyl-benzene...)
Show SMILES COc1ccnc(NC[C@@H]2C[C@H](CN2C(=O)OCc2ccccc2)OCC(=O)NC[C@H](NS(=O)(=O)c2c(C)cc(C)cc2C)C(O)=O)c1
Show InChI InChI=1S/C33H41N5O9S/c1-21-12-22(2)31(23(3)13-21)48(43,44)37-28(32(40)41)17-36-30(39)20-46-27-14-25(16-35-29-15-26(45-4)10-11-34-29)38(18-27)33(42)47-19-24-8-6-5-7-9-24/h5-13,15,25,27-28,37H,14,16-20H2,1-4H3,(H,34,35)(H,36,39)(H,40,41)/t25-,27+,28-/m0/s1
n/an/a 2.40n/an/an/an/an/an/a
Jerini AG
Curated by ChEMBL
Assay Description
Inhibition of integrin alphaVbeta3 receptor by ELISA
J Med Chem 50: 3786-94 (2007)
Article DOI: 10.1021/jm070002v
BindingDB Entry DOI: 10.7270/Q2PG1RFZ
Integrin alpha-IIb/beta-3
(Homo sapiens (Human))
BDBM50217435
(2S,4R,20S-4-{[2-carboxy-2-(2,4,6-trimethyl-benzene...)
Show SMILES COc1ccnc(NC[C@@H]2C[C@H](CN2C(=O)OCc2ccccc2)OCC(=O)NC[C@H](NS(=O)(=O)c2c(C)cc(C)cc2C)C(O)=O)c1
Show InChI InChI=1S/C33H41N5O9S/c1-21-12-22(2)31(23(3)13-21)48(43,44)37-28(32(40)41)17-36-30(39)20-46-27-14-25(16-35-29-15-26(45-4)10-11-34-29)38(18-27)33(42)47-19-24-8-6-5-7-9-24/h5-13,15,25,27-28,37H,14,16-20H2,1-4H3,(H,34,35)(H,36,39)(H,40,41)/t25-,27+,28-/m0/s1
n/an/a 7.70n/an/an/an/an/an/a
Jerini AG
Curated by ChEMBL
Assay Description
Inhibition of integrin alpha2bbeta3 receptor by ELISA
J Med Chem 50: 3786-94 (2007)
Article DOI: 10.1021/jm070002v
BindingDB Entry DOI: 10.7270/Q2PG1RFZ
Integrin alpha-5/beta-1
(Homo sapiens (Human))
BDBM50217435
(2S,4R,20S-4-{[2-carboxy-2-(2,4,6-trimethyl-benzene...)
Show SMILES COc1ccnc(NC[C@@H]2C[C@H](CN2C(=O)OCc2ccccc2)OCC(=O)NC[C@H](NS(=O)(=O)c2c(C)cc(C)cc2C)C(O)=O)c1
Show InChI InChI=1S/C33H41N5O9S/c1-21-12-22(2)31(23(3)13-21)48(43,44)37-28(32(40)41)17-36-30(39)20-46-27-14-25(16-35-29-15-26(45-4)10-11-34-29)38(18-27)33(42)47-19-24-8-6-5-7-9-24/h5-13,15,25,27-28,37H,14,16-20H2,1-4H3,(H,34,35)(H,36,39)(H,40,41)/t25-,27+,28-/m0/s1
n/an/a 1.10n/an/an/an/an/an/a
Jerini AG
Curated by ChEMBL
Assay Description
Inhibition of integrin alpha5beta1 receptor by ELISA
J Med Chem 50: 3786-94 (2007)
Article DOI: 10.1021/jm070002v
BindingDB Entry DOI: 10.7270/Q2PG1RFZ