null
SMILES: [#6]C([#6])([#6])[#8]-[#6](=O)-[#7]-1-[#6]-[#6]-[#7](-[#6]-[#6]-1)-[#6](=O)-[#7]-1-[#6@@H](-[#6@@H](-[#6]-[#6]-[#6]\[#7]=[#6](/[#7])-[#7])-[#6]-1=O)-[#6](-[#7])=O
InChI Key: InChIKey=CBGNIBUPSHCBIU-NEPJUHHUSA-N
Activity Spreadsheet -- Enzyme Inhibition Constant Data from BindingDB
Found 1 hit for monomerid = 50217812
Trg + Lig
Ki
nM
ΔG°
kcal/mole
IC50
nM
Kd
nM
EC50/IC50
nM
koff
s-1
kon
M-1s-1
pHTemp
°C
Tryptase delta
(Homo sapiens (Human))
BDBM50217812
(CHEMBL322526)
Show SMILES [#6]C([#6])([#6])[#8]-[#6](=O)-[#7]-1-[#6]-[#6]-[#7](-[#6]-[#6]-1)-[#6](=O)-[#7]-1-[#6@@H](-[#6@@H](-[#6]-[#6]-[#6]\[#7]=[#6](/[#7])-[#7])-[#6]-1=O)-[#6](-[#7])=O
Show InChI InChI=1S/C18H31N7O5/c1-18(2,3)30-17(29)24-9-7-23(8-10-24)16(28)25-12(13(19)26)11(14(25)27)5-4-6-22-15(20)21/h11-12H,4-10H2,1-3H3,(H2,19,26)(H4,20,21,22)/t11-,12+/m1/s1
n/an/a 0.400n/an/an/an/an/an/a
The Bristol-Myers Squibb Pharmaceutical Research Institute
Curated by ChEMBL
Assay Description
In vitro inhibition of human tryptase.
Bioorg Med Chem Lett 12: 3229-33 (2002)
BindingDB Entry DOI: 10.7270/Q2QC05PZ