null
SMILES: [H][C@]1(C\C=C(/C)\C=C\[C@H](O)[C@@H](C)\C=C\C(O)=O)O[C@]2(CC[C@@H]1C)CC[C@](O)(CCCC)[C@@]([H])(O2)\C=C\C(\C)=C\C(O)=O
InChI Key: InChIKey=GXOXOJOXKDUEPS-VXTFCVHNSA-N
Activity Spreadsheet -- Enzyme Inhibition Constant Data from BindingDB
Found 2 hits for monomerid = 50217844
Trg + Lig
Ki
nM
ΔG°
kcal/mole
IC50
nM
Kd
nM
EC50/IC50
nM
koff
s-1
kon
M-1s-1
pHTemp
°C
Isoleucine--tRNA ligase, cytoplasmic
(Homo sapiens (Human))
BDBM50217844
(CHEMBL115953)
Show SMILES [H][C@]1(C\C=C(/C)\C=C\[C@H](O)[C@@H](C)\C=C\C(O)=O)O[C@]2(CC[C@@H]1C)CC[C@](O)(CCCC)[C@@]([H])(O2)\C=C\C(\C)=C\C(O)=O |r|
Show InChI InChI=1S/C32H48O8/c1-6-7-17-31(38)19-20-32(40-28(31)14-10-23(3)21-30(36)37)18-16-25(5)27(39-32)13-9-22(2)8-12-26(33)24(4)11-15-29(34)35/h8-12,14-15,21,24-28,33,38H,6-7,13,16-20H2,1-5H3,(H,34,35)(H,36,37)/b12-8+,14-10+,15-11+,22-9+,23-21+/t24-,25-,26-,27+,28-,31+,32-/m0/s1
Reactome pathway
n/an/a 95n/an/an/an/an/an/a
RIKEN (Institute of Physical and Chemical Research)
Curated by ChEMBL
Assay Description
Inhibition of IleRS
Bioorg Med Chem Lett 18: 3756-60 (2008)
Article DOI: 10.1016/j.bmcl.2008.05.054
BindingDB Entry DOI: 10.7270/Q2BK1G6F
Isoleucyl-tRNA synthetase
(Rattus norvegicus)
BDBM50217844
(CHEMBL115953)
Show SMILES [H][C@]1(C\C=C(/C)\C=C\[C@H](O)[C@@H](C)\C=C\C(O)=O)O[C@]2(CC[C@@H]1C)CC[C@](O)(CCCC)[C@@]([H])(O2)\C=C\C(\C)=C\C(O)=O |r|
Show InChI InChI=1S/C32H48O8/c1-6-7-17-31(38)19-20-32(40-28(31)14-10-23(3)21-30(36)37)18-16-25(5)27(39-32)13-9-22(2)8-12-26(33)24(4)11-15-29(34)35/h8-12,14-15,21,24-28,33,38H,6-7,13,16-20H2,1-5H3,(H,34,35)(H,36,37)/b12-8+,14-10+,15-11+,22-9+,23-21+/t24-,25-,26-,27+,28-,31+,32-/m0/s1
n/an/a 42n/an/an/an/an/an/a
RIKEN (The Institute of Physical and Chemical Research)
Curated by ChEMBL
Assay Description
Inhibitory concentration against Isoleucyl-tRNA synthetase (IleRS) activity
Bioorg Med Chem Lett 12: 3363-6 (2002)
BindingDB Entry DOI: 10.7270/Q2B56MX8