null
SMILES: [H][C@]1(C\C=C(/C)\C=C\[C@H](O)[C@@H](C)\C=C\C(O)=O)O[C@]2(CC[C@@H]1C)CC[C@@](CCCC)(OC(=O)CCC(O)=O)[C@@]([H])(O2)\C=C\C=C\C(=O)OC
InChI Key: InChIKey=VAKFABNTNXWGFF-MPDJDRLOSA-N
Activity Spreadsheet -- Enzyme Inhibition Constant Data from BindingDB
Found 1 hit for monomerid = 50217846
Trg + Lig
Ki
nM
ΔG°
kcal/mole
IC50
nM
Kd
nM
EC50/IC50
nM
koff
s-1
kon
M-1s-1
pHTemp
°C
Isoleucyl-tRNA synthetase
(Rattus norvegicus)
BDBM50217846
(CHEMBL332420)
Show SMILES [H][C@]1(C\C=C(/C)\C=C\[C@H](O)[C@@H](C)\C=C\C(O)=O)O[C@]2(CC[C@@H]1C)CC[C@@](CCCC)(OC(=O)CCC(O)=O)[C@@]([H])(O2)\C=C\C=C\C(=O)OC
Show InChI InChI=1S/C36H52O11/c1-6-7-21-35(47-34(43)19-18-32(40)41)23-24-36(46-30(35)10-8-9-11-33(42)44-5)22-20-27(4)29(45-36)16-13-25(2)12-15-28(37)26(3)14-17-31(38)39/h8-15,17,26-30,37H,6-7,16,18-24H2,1-5H3,(H,38,39)(H,40,41)/b10-8+,11-9+,15-12+,17-14+,25-13+/t26-,27-,28-,29+,30-,35+,36-/m0/s1
n/an/a 491n/an/an/an/an/an/a
RIKEN (The Institute of Physical and Chemical Research)
Curated by ChEMBL
Assay Description
Inhibitory concentration against Isoleucyl-tRNA synthetase (IleRS) activity
Bioorg Med Chem Lett 12: 3363-6 (2002)
BindingDB Entry DOI: 10.7270/Q2B56MX8