BDBM50217916 3-[(3-chlorophenyl)sulfonyl]-1-piperidin-3-yl-1Hpyrrolo[2,3-b]pyridine::CHEMBL393997
SMILES: Clc1cccc(c1)S(=O)(=O)c1cn(C2CCCNC2)c2ncccc12
InChI Key: InChIKey=ASKBSODPKRADGV-UHFFFAOYSA-N
Data: 2 KI  1 EC50
Activity Spreadsheet -- Enzyme Inhibition Constant Data from BindingDB
Found 3 hits for monomerid = 50217916
Trg + Lig
Ki
nM
ΔG°
kcal/mole
IC50
nM
Kd
nM
EC50/IC50
nM
koff
s-1
kon
M-1s-1
pHTemp
°C
5-hydroxytryptamine receptor 6
(Homo sapiens (Human))
BDBM50217916
(3-[(3-chlorophenyl)sulfonyl]-1-piperidin-3-yl-1Hpy...)
Show SMILES Clc1cccc(c1)S(=O)(=O)c1cn(C2CCCNC2)c2ncccc12 |w:13.13|
Show InChI InChI=1S/C18H18ClN3O2S/c19-13-4-1-6-15(10-13)25(23,24)17-12-22(14-5-2-8-20-11-14)18-16(17)7-3-9-21-18/h1,3-4,6-7,9-10,12,14,20H,2,5,8,11H2
Reactome pathway
1.29n/an/an/an/an/an/an/an/a
Islamic Azad University
Curated by ChEMBL
Assay Description
Binding affinity to 5HT6 receptor
Eur J Med Chem 45: 3911-5 (2010)
Article DOI: 10.1016/j.ejmech.2010.05.045
BindingDB Entry DOI: 10.7270/Q27945XK
5-hydroxytryptamine receptor 6
(Homo sapiens (Human))
BDBM50217916
(3-[(3-chlorophenyl)sulfonyl]-1-piperidin-3-yl-1Hpy...)
Show SMILES Clc1cccc(c1)S(=O)(=O)c1cn(C2CCCNC2)c2ncccc12 |w:13.13|
Show InChI InChI=1S/C18H18ClN3O2S/c19-13-4-1-6-15(10-13)25(23,24)17-12-22(14-5-2-8-20-11-14)18-16(17)7-3-9-21-18/h1,3-4,6-7,9-10,12,14,20H,2,5,8,11H2
Reactome pathway
1.30n/an/an/an/an/an/an/an/a
Wyeth Research
Curated by ChEMBL
Assay Description
Displacement of [3H]LSD from cloned human 5HT6 expressed in HeLa cells
Bioorg Med Chem 15: 6208-26 (2007)
Article DOI: 10.1016/j.bmc.2007.06.024
BindingDB Entry DOI: 10.7270/Q2HT2P2G
5-hydroxytryptamine receptor 6
(Homo sapiens (Human))
BDBM50217916
(3-[(3-chlorophenyl)sulfonyl]-1-piperidin-3-yl-1Hpy...)
Show SMILES Clc1cccc(c1)S(=O)(=O)c1cn(C2CCCNC2)c2ncccc12 |w:13.13|
Show InChI InChI=1S/C18H18ClN3O2S/c19-13-4-1-6-15(10-13)25(23,24)17-12-22(14-5-2-8-20-11-14)18-16(17)7-3-9-21-18/h1,3-4,6-7,9-10,12,14,20H,2,5,8,11H2
Reactome pathway
n/an/an/an/a 30n/an/an/an/a
Wyeth Research
Curated by ChEMBL
Assay Description
Agonist activity at human 5HT6 expressed in HeLa cells assessed as intracellular cAMP level by radioimmunoassay
Bioorg Med Chem 15: 6208-26 (2007)
Article DOI: 10.1016/j.bmc.2007.06.024
BindingDB Entry DOI: 10.7270/Q2HT2P2G