BDBM50217935 CHEMBL114859
SMILES: [H][C@]1(C\C=C(/C)\C=C\[C@H](O)[C@@H](C)\C=C\C(O)=O)O[C@]2(CC[C@@H]1C)CC[C@@](CCCC)(OC)[C@@]([H])(O2)\C=C\C(\C)=C\C(O)=O
InChI Key: InChIKey=HLGCQPMVAUVQRL-LTPNEUAOSA-N
Data: 2 IC50
Activity Spreadsheet -- Enzyme Inhibition Constant Data from BindingDB
Found 2 hits for monomerid = 50217935
Trg + Lig
Ki
nM
ΔG°
kcal/mole
IC50
nM
Kd
nM
EC50/IC50
nM
koff
s-1
kon
M-1s-1
pHTemp
°C
Isoleucyl-tRNA synthetase
(Homo sapiens (Human))
BDBM50217935
(CHEMBL114859)
Show SMILES [H][C@]1(C\C=C(/C)\C=C\[C@H](O)[C@@H](C)\C=C\C(O)=O)O[C@]2(CC[C@@H]1C)CC[C@@](CCCC)(OC)[C@@]([H])(O2)\C=C\C(\C)=C\C(O)=O |r|
Show InChI InChI=1S/C33H50O8/c1-7-8-18-32(39-6)20-21-33(41-29(32)15-11-24(3)22-31(37)38)19-17-26(5)28(40-33)14-10-23(2)9-13-27(34)25(4)12-16-30(35)36/h9-13,15-16,22,25-29,34H,7-8,14,17-21H2,1-6H3,(H,35,36)(H,37,38)/b13-9+,15-11+,16-12+,23-10+,24-22+/t25-,26-,27-,28+,29-,32+,33-/m0/s1
Reactome pathway
n/an/a 58n/an/an/an/an/an/a
RIKEN (Institute of Physical and Chemical Research)
Curated by ChEMBL
Assay Description
Inhibition of IleRS
Bioorg Med Chem Lett 18: 3756-60 (2008)
Article DOI: 10.1016/j.bmcl.2008.05.054
BindingDB Entry DOI: 10.7270/Q2BK1G6F
Isoleucyl-tRNA synthetase
(Rattus norvegicus)
BDBM50217935
(CHEMBL114859)
Show SMILES [H][C@]1(C\C=C(/C)\C=C\[C@H](O)[C@@H](C)\C=C\C(O)=O)O[C@]2(CC[C@@H]1C)CC[C@@](CCCC)(OC)[C@@]([H])(O2)\C=C\C(\C)=C\C(O)=O |r|
Show InChI InChI=1S/C33H50O8/c1-7-8-18-32(39-6)20-21-33(41-29(32)15-11-24(3)22-31(37)38)19-17-26(5)28(40-33)14-10-23(2)9-13-27(34)25(4)12-16-30(35)36/h9-13,15-16,22,25-29,34H,7-8,14,17-21H2,1-6H3,(H,35,36)(H,37,38)/b13-9+,15-11+,16-12+,23-10+,24-22+/t25-,26-,27-,28+,29-,32+,33-/m0/s1
n/an/a 26n/an/an/an/an/an/a
RIKEN (The Institute of Physical and Chemical Research)
Curated by ChEMBL
Assay Description
Inhibitory concentration against Isoleucyl-tRNA synthetase (IleRS) activity
Bioorg Med Chem Lett 12: 3363-6 (2002)
BindingDB Entry DOI: 10.7270/Q2B56MX8