BDBM50218168 (R)-2-(2-(4-(2-ethyloxazol-4-yl)phenoxy)ethylamino)-1-(pyridin-3-yl)ethanol::CHEMBL400049
SMILES: CCc1nc(co1)-c1ccc(OCCNC[C@H](O)c2cccnc2)cc1
InChI Key: InChIKey=HGWFPEHKILIAAE-IBGZPJMESA-N
Data: 2 KI  1 EC50
Activity Spreadsheet -- Enzyme Inhibition Constant Data from BindingDB
Found 3 hits for monomerid = 50218168
Trg + Lig
Ki
nM
ΔG°
kcal/mole
IC50
nM
Kd
nM
EC50/IC50
nM
koff
s-1
kon
M-1s-1
pHTemp
°C
Beta-2 adrenergic receptor
(Homo sapiens (Human))
BDBM50218168
((R)-2-(2-(4-(2-ethyloxazol-4-yl)phenoxy)ethylamino...)
Show SMILES CCc1nc(co1)-c1ccc(OCCNC[C@H](O)c2cccnc2)cc1
Show InChI InChI=1S/C20H23N3O3/c1-2-20-23-18(14-26-20)15-5-7-17(8-6-15)25-11-10-22-13-19(24)16-4-3-9-21-12-16/h3-9,12,14,19,22,24H,2,10-11,13H2,1H3/t19-/m0/s1
Reactome pathway
37n/an/an/an/an/an/an/an/a
Pfizer Global Research and Development
Curated by ChEMBL
Assay Description
Displacement of [125I]iodocyanopindolol from human adrenergic beta-2 receptor expressed in CHO cells
Bioorg Med Chem Lett 17: 5245-50 (2007)
Article DOI: 10.1016/j.bmcl.2007.06.072
BindingDB Entry DOI: 10.7270/Q2MK6CMZ
Beta-1 adrenergic receptor
(Homo sapiens (Human))
BDBM50218168
((R)-2-(2-(4-(2-ethyloxazol-4-yl)phenoxy)ethylamino...)
Show SMILES CCc1nc(co1)-c1ccc(OCCNC[C@H](O)c2cccnc2)cc1
Show InChI InChI=1S/C20H23N3O3/c1-2-20-23-18(14-26-20)15-5-7-17(8-6-15)25-11-10-22-13-19(24)16-4-3-9-21-12-16/h3-9,12,14,19,22,24H,2,10-11,13H2,1H3/t19-/m0/s1
Reactome pathway
400n/an/an/an/an/an/an/an/a
Pfizer Global Research and Development
Curated by ChEMBL
Assay Description
Displacement of [125I]iodocyanopindolol from human adrenergic beta-1 receptor expressed in CHO cells
Bioorg Med Chem Lett 17: 5245-50 (2007)
Article DOI: 10.1016/j.bmcl.2007.06.072
BindingDB Entry DOI: 10.7270/Q2MK6CMZ
Beta-3 adrenergic receptor
(Homo sapiens (Human))
BDBM50218168
((R)-2-(2-(4-(2-ethyloxazol-4-yl)phenoxy)ethylamino...)
Show SMILES CCc1nc(co1)-c1ccc(OCCNC[C@H](O)c2cccnc2)cc1
Show InChI InChI=1S/C20H23N3O3/c1-2-20-23-18(14-26-20)15-5-7-17(8-6-15)25-11-10-22-13-19(24)16-4-3-9-21-12-16/h3-9,12,14,19,22,24H,2,10-11,13H2,1H3/t19-/m0/s1
Reactome pathway
n/an/an/an/a 57n/an/an/an/a
Pfizer Global Research and Development
Curated by ChEMBL
Assay Description
Agonist activity at human adrenergic beta-3 receptor expressed in CHO cells assessed as cAMP production
Bioorg Med Chem Lett 17: 5245-50 (2007)
Article DOI: 10.1016/j.bmcl.2007.06.072
BindingDB Entry DOI: 10.7270/Q2MK6CMZ