BDBM50218176 (R)-1-(pyridin-3-yl)-2-(2-(4-(2-(pyridin-4-yl)thiazol-4-yl)phenoxy)ethylamino)ethanol::CHEMBL399522
SMILES: O[C@@H](CNCCOc1ccc(cc1)-c1csc(n1)-c1ccncc1)c1cccnc1
InChI Key: InChIKey=HCYMCYGSEHNSSU-QFIPXVFZSA-N
Data: 1 KI  1 EC50
Activity Spreadsheet -- Enzyme Inhibition Constant Data from BindingDB
Found 2 hits for monomerid = 50218176
Trg + Lig
Ki
nM
ΔG°
kcal/mole
IC50
nM
Kd
nM
EC50/IC50
nM
koff
s-1
kon
M-1s-1
pHTemp
°C
Beta-1 adrenergic receptor
(Homo sapiens (Human))
BDBM50218176
((R)-1-(pyridin-3-yl)-2-(2-(4-(2-(pyridin-4-yl)thia...)
Show SMILES O[C@@H](CNCCOc1ccc(cc1)-c1csc(n1)-c1ccncc1)c1cccnc1
Show InChI InChI=1S/C23H22N4O2S/c28-22(19-2-1-9-25-14-19)15-26-12-13-29-20-5-3-17(4-6-20)21-16-30-23(27-21)18-7-10-24-11-8-18/h1-11,14,16,22,26,28H,12-13,15H2/t22-/m0/s1
Reactome pathway
97n/an/an/an/an/an/an/an/a
Pfizer Global Research and Development
Curated by ChEMBL
Assay Description
Displacement of [125I]iodocyanopindolol from human adrenergic beta-1 receptor expressed in CHO cells
Bioorg Med Chem Lett 17: 5245-50 (2007)
Article DOI: 10.1016/j.bmcl.2007.06.072
BindingDB Entry DOI: 10.7270/Q2MK6CMZ
Beta-3 adrenergic receptor
(Homo sapiens (Human))
BDBM50218176
((R)-1-(pyridin-3-yl)-2-(2-(4-(2-(pyridin-4-yl)thia...)
Show SMILES O[C@@H](CNCCOc1ccc(cc1)-c1csc(n1)-c1ccncc1)c1cccnc1
Show InChI InChI=1S/C23H22N4O2S/c28-22(19-2-1-9-25-14-19)15-26-12-13-29-20-5-3-17(4-6-20)21-16-30-23(27-21)18-7-10-24-11-8-18/h1-11,14,16,22,26,28H,12-13,15H2/t22-/m0/s1
Reactome pathway
n/an/an/an/a 65n/an/an/an/a
Pfizer Global Research and Development
Curated by ChEMBL
Assay Description
Agonist activity at human adrenergic beta-3 receptor expressed in CHO cells assessed as cAMP production
Bioorg Med Chem Lett 17: 5245-50 (2007)
Article DOI: 10.1016/j.bmcl.2007.06.072
BindingDB Entry DOI: 10.7270/Q2MK6CMZ