BDBM50218182 (R)-1-(pyridin-3-yl)-2-(2-(4-(2-(trifluoromethyl)thiazol-4-yl)phenoxy)ethylamino)ethanol::CHEMBL251600
SMILES: O[C@@H](CNCCOc1ccc(cc1)-c1csc(n1)C(F)(F)F)c1cccnc1
InChI Key: InChIKey=KSSIJUJWXZXKGL-KRWDZBQOSA-N
Data: 1 KI  1 EC50
Activity Spreadsheet -- Enzyme Inhibition Constant Data from BindingDB
Found 2 hits for monomerid = 50218182
Trg + Lig
Ki
nM
ΔG°
kcal/mole
IC50
nM
Kd
nM
EC50/IC50
nM
koff
s-1
kon
M-1s-1
pHTemp
°C
Beta-1 adrenergic receptor
(Homo sapiens (Human))
BDBM50218182
((R)-1-(pyridin-3-yl)-2-(2-(4-(2-(trifluoromethyl)t...)
Show SMILES O[C@@H](CNCCOc1ccc(cc1)-c1csc(n1)C(F)(F)F)c1cccnc1
Show InChI InChI=1S/C19H18F3N3O2S/c20-19(21,22)18-25-16(12-28-18)13-3-5-15(6-4-13)27-9-8-24-11-17(26)14-2-1-7-23-10-14/h1-7,10,12,17,24,26H,8-9,11H2/t17-/m0/s1
Reactome pathway
100n/an/an/an/an/an/an/an/a
Pfizer Global Research and Development
Curated by ChEMBL
Assay Description
Displacement of [125I]iodocyanopindolol from human adrenergic beta-1 receptor expressed in CHO cells
Bioorg Med Chem Lett 17: 5245-50 (2007)
Article DOI: 10.1016/j.bmcl.2007.06.072
BindingDB Entry DOI: 10.7270/Q2MK6CMZ
Beta-3 adrenergic receptor
(Homo sapiens (Human))
BDBM50218182
((R)-1-(pyridin-3-yl)-2-(2-(4-(2-(trifluoromethyl)t...)
Show SMILES O[C@@H](CNCCOc1ccc(cc1)-c1csc(n1)C(F)(F)F)c1cccnc1
Show InChI InChI=1S/C19H18F3N3O2S/c20-19(21,22)18-25-16(12-28-18)13-3-5-15(6-4-13)27-9-8-24-11-17(26)14-2-1-7-23-10-14/h1-7,10,12,17,24,26H,8-9,11H2/t17-/m0/s1
Reactome pathway
n/an/an/an/a 200n/an/an/an/a
Pfizer Global Research and Development
Curated by ChEMBL
Assay Description
Agonist activity at human adrenergic beta-3 receptor expressed in CHO cells assessed as cAMP production
Bioorg Med Chem Lett 17: 5245-50 (2007)
Article DOI: 10.1016/j.bmcl.2007.06.072
BindingDB Entry DOI: 10.7270/Q2MK6CMZ