null
SMILES: CCCN1c2ccc(NS(=O)(=O)c3ccc(F)cc3)cc2N=C(c2ccc(cc2)C(O)=O)c2cc3c(cc12)C(C)(C)CCC3(C)C
InChI Key: InChIKey=RAJOVFJSIKUPMV-UHFFFAOYSA-N
Activity Spreadsheet -- Enzyme Inhibition Constant Data from BindingDB
Found 2 hits for monomerid = 50218481
Trg + Lig
Ki
nM
ΔG°
kcal/mole
IC50
nM
Kd
nM
EC50/IC50
nM
koff
s-1
kon
M-1s-1
pHTemp
°C
Retinoic acid receptor RXR-alpha
(Homo sapiens (Human))
BDBM50218481
(4-[2-(4-fluoro-benzenesulfonylamino)-7,7,10,10-tet...)
Show SMILES CCCN1c2ccc(NS(=O)(=O)c3ccc(F)cc3)cc2N=C(c2ccc(cc2)C(O)=O)c2cc3c(cc12)C(C)(C)CCC3(C)C |t:23|
Show InChI InChI=1S/C37H38FN3O4S/c1-6-19-41-32-16-13-26(40-46(44,45)27-14-11-25(38)12-15-27)20-31(32)39-34(23-7-9-24(10-8-23)35(42)43)28-21-29-30(22-33(28)41)37(4,5)18-17-36(29,2)3/h7-16,20-22,40H,6,17-19H2,1-5H3,(H,42,43)
NCI pathway
Reactome pathway
n/an/a 810n/an/an/an/an/an/a
Tsukuba Research Institute
Curated by ChEMBL
Assay Description
Antagonist activity at human RXRalpha expressed in EK293 cells assessed as inhibition of LG100268-induced transactivation
Bioorg Med Chem Lett 17: 4808-11 (2007)
Article DOI: 10.1016/j.bmcl.2007.06.079
BindingDB Entry DOI: 10.7270/Q2V40TWB
Retinoic acid receptor RXR-alpha
(Homo sapiens (Human))
BDBM50218481
(4-[2-(4-fluoro-benzenesulfonylamino)-7,7,10,10-tet...)
Show SMILES CCCN1c2ccc(NS(=O)(=O)c3ccc(F)cc3)cc2N=C(c2ccc(cc2)C(O)=O)c2cc3c(cc12)C(C)(C)CCC3(C)C |t:23|
Show InChI InChI=1S/C37H38FN3O4S/c1-6-19-41-32-16-13-26(40-46(44,45)27-14-11-25(38)12-15-27)20-31(32)39-34(23-7-9-24(10-8-23)35(42)43)28-21-29-30(22-33(28)41)37(4,5)18-17-36(29,2)3/h7-16,20-22,40H,6,17-19H2,1-5H3,(H,42,43)
NCI pathway
Reactome pathway
n/an/a 130n/an/an/an/an/an/a
Tsukuba Research Institute
Curated by ChEMBL
Assay Description
Antagonist activity at human RXRalpha expressed in EK293 cells assessed as inhibition of 9-cis-retinoic acid-induced transactivation
Bioorg Med Chem Lett 17: 4808-11 (2007)
Article DOI: 10.1016/j.bmcl.2007.06.079
BindingDB Entry DOI: 10.7270/Q2V40TWB