BDBM50218677 CHEMBL242005::N-(5-tert-butyl-2-methoxy-3-(methylsulfonamido)phenyl)benzo[b]thiophene-2-carboxamide::benzo[b]thiophene-2-carboxylic acid (5-tert-Butyl-3-methanesulfonylamino-2-methoxy-phenyl)-amide
SMILES: COc1c(NC(=O)c2cc3ccccc3s2)cc(cc1NS(C)(=O)=O)C(C)(C)C
InChI Key: InChIKey=XEUYPMUQCOVVHK-UHFFFAOYSA-N
Data: 1 IC50
Activity Spreadsheet -- Enzyme Inhibition Constant Data from BindingDB
Found 1 hit for monomerid = 50218677
Trg + Lig
Ki
nM
ΔG°
kcal/mole
IC50
nM
Kd
nM
EC50/IC50
nM
koff
s-1
kon
M-1s-1
pHTemp
°C
Mitogen-activated protein kinase 14
(Homo sapiens (Human))
BDBM50218677
(CHEMBL242005 | N-(5-tert-butyl-2-methoxy-3-(methyl...)
Show SMILES COc1c(NC(=O)c2cc3ccccc3s2)cc(cc1NS(C)(=O)=O)C(C)(C)C
Show InChI InChI=1S/C21H24N2O4S2/c1-21(2,3)14-11-15(19(27-4)16(12-14)23-29(5,25)26)22-20(24)18-10-13-8-6-7-9-17(13)28-18/h6-12,23H,1-5H3,(H,22,24)
NCI pathway
Reactome pathway
n/an/a 2.70E+3n/an/an/an/an/an/a
Boehringer Ingelheim Pharmaceutical
Curated by ChEMBL
Assay Description
Binding affinity to p38alpha (unknown origin) assessed as inhibition of ATF2 phosphorylation preincubated for 4 hrs
Bioorg Med Chem Lett 19: 2386-91 (2009)
Article DOI: 10.1016/j.bmcl.2009.03.104
BindingDB Entry DOI: 10.7270/Q22N525R