BDBM50218785 CHEMBL76687
SMILES: CC(C)(Oc1ccc2ccc(=O)oc2c1CC=C)C#C
InChI Key: InChIKey=IEZCQCFDJJWVGD-UHFFFAOYSA-N
Data: 1 IC50
Activity Spreadsheet -- Enzyme Inhibition Constant Data from BindingDB
Found 1 hit for monomerid = 50218785
Trg + Lig
Ki
nM
ΔG°
kcal/mole
IC50
nM
Kd
nM
EC50/IC50
nM
koff
s-1
kon
M-1s-1
pHTemp
°C
Steroid 5-alpha-reductase
(Homo sapiens (Human))
BDBM50218785
(CHEMBL76687)
Show SMILES CC(C)(Oc1ccc2ccc(=O)oc2c1CC=C)C#C
Show InChI InChI=1S/C17H16O3/c1-5-7-13-14(20-17(3,4)6-2)10-8-12-9-11-15(18)19-16(12)13/h2,5,8-11H,1,7H2,3-4H3
n/an/a>4n/an/an/an/an/an/a
Seoul National University
Curated by ChEMBL
Assay Description
Inhibitory activity against 5-alpha-reductase type 1 in cell culture system using LNCaP cells (androgen-sensitive human prostatic cancer cell line)
Bioorg Med Chem Lett 11: 2361-3 (2001)
BindingDB Entry DOI: 10.7270/Q2RR1ZS9