BDBM50218897 7-bromoindirubin-3-acetoxime::CHEMBL395766
SMILES: CC(=O)ON=C1C(Nc2ccccc12)=C1C(=O)Nc2c1cccc2Br
InChI Key: InChIKey=GSXNABRCKCRBSO-UHFFFAOYSA-N
Data: 3 IC50
Activity Spreadsheet -- Enzyme Inhibition Constant Data from BindingDB
Found 3 hits for monomerid = 50218897
Trg + Lig
Ki
nM
ΔG°
kcal/mole
IC50
nM
Kd
nM
EC50/IC50
nM
koff
s-1
kon
M-1s-1
pHTemp
°C
Aurora kinase B
(Homo sapiens (Human))
BDBM50218897
(7-bromoindirubin-3-acetoxime | CHEMBL395766)
Show SMILES CC(=O)ON=C1C(Nc2ccccc12)=C1C(=O)Nc2c1cccc2Br |w:6.6,4.3|
Show InChI InChI=1S/C18H12BrN3O3/c1-9(23)25-22-16-10-5-2-3-8-13(10)20-17(16)14-11-6-4-7-12(19)15(11)21-18(14)24/h2-8,20H,1H3,(H,21,24)
Reactome pathway
n/an/a 2.00E+4n/an/an/an/an/an/a
University of Athens
Curated by ChEMBL
Assay Description
Inhibition of human recombinant aurora B kinase
J Med Chem 50: 4027-37 (2007)
Article DOI: 10.1021/jm070077z
BindingDB Entry DOI: 10.7270/Q2PC323X
Serine/threonine-protein kinase Aurora-C
(Homo sapiens (Human))
BDBM50218897
(7-bromoindirubin-3-acetoxime | CHEMBL395766)
Show SMILES CC(=O)ON=C1C(Nc2ccccc12)=C1C(=O)Nc2c1cccc2Br |w:6.6,4.3|
Show InChI InChI=1S/C18H12BrN3O3/c1-9(23)25-22-16-10-5-2-3-8-13(10)20-17(16)14-11-6-4-7-12(19)15(11)21-18(14)24/h2-8,20H,1H3,(H,21,24)
NCI pathway
n/an/a 4.50E+3n/an/an/an/an/an/a
University of Athens
Curated by ChEMBL
Assay Description
Inhibition of human recombinant aurora C kinase
J Med Chem 50: 4027-37 (2007)
Article DOI: 10.1021/jm070077z
BindingDB Entry DOI: 10.7270/Q2PC323X
Aurora kinase A
(Homo sapiens (Human))
BDBM50218897
(7-bromoindirubin-3-acetoxime | CHEMBL395766)
Show SMILES CC(=O)ON=C1C(Nc2ccccc12)=C1C(=O)Nc2c1cccc2Br |w:6.6,4.3|
Show InChI InChI=1S/C18H12BrN3O3/c1-9(23)25-22-16-10-5-2-3-8-13(10)20-17(16)14-11-6-4-7-12(19)15(11)21-18(14)24/h2-8,20H,1H3,(H,21,24)
NCI pathway
Reactome pathway
n/an/a>1.00E+5n/an/an/an/an/an/a
University of Athens
Curated by ChEMBL
Assay Description
Inhibition of human recombinant aurora A kinase
J Med Chem 50: 4027-37 (2007)
Article DOI: 10.1021/jm070077z
BindingDB Entry DOI: 10.7270/Q2PC323X