BDBM50218938 CHEMBL396753::sodium (8S,9R)-10(E)-ethylidene-4(S)-isopropoxy-11-oxo-1-azatricyclo[7.2.0.03,8]undec-2-enecarboxylate
SMILES: C\C=C1/[C@H]2[C@H]3CCC[C@H](OC(C)C)C3=C(N2C1=O)C([O-])=O
InChI Key: InChIKey=VDZDNZXKYYQECM-UIXYVRDFSA-M
Data: 3 IC50
Activity Spreadsheet -- Enzyme Inhibition Constant Data from BindingDB
Found 3 hits for monomerid = 50218938
Trg + Lig
Ki
nM
ΔG°
kcal/mole
IC50
nM
Kd
nM
EC50/IC50
nM
koff
s-1
kon
M-1s-1
pHTemp
°C
SHV-1 beta-lactamase
(Klebsiella pneumoniae (Enterobacteria))
BDBM50218938
(CHEMBL396753 | sodium (8S,9R)-10(E)-ethylidene-4(S...)
Show SMILES C\C=C1/[C@H]2[C@H]3CCC[C@H](OC(C)C)C3=C(N2C1=O)C([O-])=O |c:14|
Show InChI InChI=1S/C16H21NO4/c1-4-9-13-10-6-5-7-11(21-8(2)3)12(10)14(16(19)20)17(13)15(9)18/h4,8,10-11,13H,5-7H2,1-3H3,(H,19,20)/p-1/b9-4+/t10-,11-,13-/m0/s1
n/an/a 340n/an/an/an/an/an/a
Lek Pharmaceuticals d.d.
Curated by ChEMBL
Assay Description
Inhibition of Escherichia coli SHV1
J Med Chem 50: 4113-21 (2007)
Article DOI: 10.1021/jm0703237
BindingDB Entry DOI: 10.7270/Q2FF3T5F
Beta-lactamase (TEM-1)
(Escherichia coli)
BDBM50218938
(CHEMBL396753 | sodium (8S,9R)-10(E)-ethylidene-4(S...)
Show SMILES C\C=C1/[C@H]2[C@H]3CCC[C@H](OC(C)C)C3=C(N2C1=O)C([O-])=O |c:14|
Show InChI InChI=1S/C16H21NO4/c1-4-9-13-10-6-5-7-11(21-8(2)3)12(10)14(16(19)20)17(13)15(9)18/h4,8,10-11,13H,5-7H2,1-3H3,(H,19,20)/p-1/b9-4+/t10-,11-,13-/m0/s1
n/an/a 39n/an/an/an/an/an/a
Lek Pharmaceuticals d.d.
Curated by ChEMBL
Assay Description
Inhibition of Escherichia coli TEM1
J Med Chem 50: 4113-21 (2007)
Article DOI: 10.1021/jm0703237
BindingDB Entry DOI: 10.7270/Q2FF3T5F
Beta-lactamase
(Enterobacter cloacae)
BDBM50218938
(CHEMBL396753 | sodium (8S,9R)-10(E)-ethylidene-4(S...)
Show SMILES C\C=C1/[C@H]2[C@H]3CCC[C@H](OC(C)C)C3=C(N2C1=O)C([O-])=O |c:14|
Show InChI InChI=1S/C16H21NO4/c1-4-9-13-10-6-5-7-11(21-8(2)3)12(10)14(16(19)20)17(13)15(9)18/h4,8,10-11,13H,5-7H2,1-3H3,(H,19,20)/p-1/b9-4+/t10-,11-,13-/m0/s1
n/an/a 341n/an/an/an/an/an/a
Lek Pharmaceuticals d.d.
Curated by ChEMBL
Assay Description
Inhibition of Enterobacter cloacae AmpC
J Med Chem 50: 4113-21 (2007)
Article DOI: 10.1021/jm0703237
BindingDB Entry DOI: 10.7270/Q2FF3T5F