BDBM50219252 CHEMBL159932
SMILES: COCCCNc1nccc(n1)-c1[nH]c(nc1-c1ccc(F)cc1)[C@H]1OC[C@@](C)(CO1)C(=O)N1CCOCC1
InChI Key: InChIKey=MLQOKWSMWZUBCM-HNKWHGCMSA-N
Data: 1 IC50
Activity Spreadsheet -- Enzyme Inhibition Constant Data from BindingDB
Found 1 hit for monomerid = 50219252
Trg + Lig
Ki
nM
ΔG°
kcal/mole
IC50
nM
Kd
nM
EC50/IC50
nM
koff
s-1
kon
M-1s-1
pHTemp
°C
Mitogen-activated protein kinase 13
(Mus musculus)
BDBM50219252
(CHEMBL159932)
Show SMILES COCCCNc1nccc(n1)-c1[nH]c(nc1-c1ccc(F)cc1)[C@H]1OC[C@@](C)(CO1)C(=O)N1CCOCC1 |wU:24.26,27.30,wD:27.34,(-7.57,.44,;-6.24,-.34,;-4.9,.42,;-3.57,-.35,;-2.24,.42,;-.9,-.35,;.43,.42,;.43,1.96,;1.76,2.74,;3.12,1.96,;3.12,.42,;1.76,-.35,;4.45,-.35,;5.85,.28,;6.91,-.87,;6.13,-2.2,;4.61,-1.88,;3.47,-2.92,;3.8,-4.42,;2.65,-5.45,;1.18,-4.98,;.03,-6.02,;.85,-3.47,;2,-2.44,;8.43,-.7,;9.06,.72,;10.58,.88,;11.49,-.37,;12.26,.96,;10.86,-1.78,;9.34,-1.94,;12.82,-1.15,;12.82,-2.69,;14.15,-.37,;14.15,1.17,;15.51,1.93,;16.84,1.16,;16.82,-.38,;15.49,-1.15,)|
Show InChI InChI=1S/C27H33FN6O5/c1-27(25(35)34-11-14-37-15-12-34)16-38-24(39-17-27)23-32-21(18-4-6-19(28)7-5-18)22(33-23)20-8-10-30-26(31-20)29-9-3-13-36-2/h4-8,10,24H,3,9,11-17H2,1-2H3,(H,32,33)(H,29,30,31)/t24-,27-
n/an/a 7n/an/an/an/an/an/a
Aventis Pharma
Curated by ChEMBL
Assay Description
Inhibition of murine Mitogen-activated protein kinase p38
Bioorg Med Chem Lett 11: 693-6 (2001)
BindingDB Entry DOI: 10.7270/Q2F191WG