BDBM50219414 CHEMBL79661
SMILES: COc1ccc2C(Cc3c(Cl)cncc3Cl)=NN(Cc2c1)S(C)(=O)=O
InChI Key: InChIKey=UBVKVEOYBYZYGM-UHFFFAOYSA-N
Data: 1 KI  3 IC50
Activity Spreadsheet -- Enzyme Inhibition Constant Data from BindingDB
Found 4 hits for monomerid = 50219414
Trg + Lig
Ki
nM
ΔG°
kcal/mole
IC50
nM
Kd
nM
EC50/IC50
nM
koff
s-1
kon
M-1s-1
pHTemp
°C
Phosphodiesterase 4
(Homo sapiens (Human))
BDBM50219414
(CHEMBL79661)
Show SMILES COc1ccc2C(Cc3c(Cl)cncc3Cl)=NN(Cc2c1)S(C)(=O)=O |c:16|
Show InChI InChI=1S/C16H15Cl2N3O3S/c1-24-11-3-4-12-10(5-11)9-21(25(2,22)23)20-16(12)6-13-14(17)7-19-8-15(13)18/h3-5,7-8H,6,9H2,1-2H3
60n/an/an/an/an/an/an/an/a
Zambon Group
Curated by ChEMBL
Assay Description
Affinity for rolipram binding site (RBS) of human neutrophil phosphodiesterase type IV (PDE4)
Bioorg Med Chem Lett 12: 5-8 (2002)
BindingDB Entry DOI: 10.7270/Q2SB47Z5
Phosphodiesterase 4
(Homo sapiens (Human))
BDBM50219414
(CHEMBL79661)
Show SMILES COc1ccc2C(Cc3c(Cl)cncc3Cl)=NN(Cc2c1)S(C)(=O)=O |c:16|
Show InChI InChI=1S/C16H15Cl2N3O3S/c1-24-11-3-4-12-10(5-11)9-21(25(2,22)23)20-16(12)6-13-14(17)7-19-8-15(13)18/h3-5,7-8H,6,9H2,1-2H3
n/an/a 21n/an/an/an/an/an/a
Zambon Group
Curated by ChEMBL
Assay Description
Inhibition of human neutrophil phosphodiesterase type IV (PDE4)
Bioorg Med Chem Lett 12: 5-8 (2002)
BindingDB Entry DOI: 10.7270/Q2SB47Z5
Phosphodiesterase 4
(Homo sapiens (Human))
BDBM50219414
(CHEMBL79661)
Show SMILES COc1ccc2C(Cc3c(Cl)cncc3Cl)=NN(Cc2c1)S(C)(=O)=O |c:16|
Show InChI InChI=1S/C16H15Cl2N3O3S/c1-24-11-3-4-12-10(5-11)9-21(25(2,22)23)20-16(12)6-13-14(17)7-19-8-15(13)18/h3-5,7-8H,6,9H2,1-2H3
n/an/a 21n/an/an/an/an/an/a
National Institute of Pharmaceutical Education and Research
Curated by ChEMBL
Assay Description
In vitro inhibitory concentration against phosphodiesterase 4.
Bioorg Med Chem Lett 13: 2473-9 (2003)
BindingDB Entry DOI: 10.7270/Q24F1SXB
Phosphodiesterase 4
(Homo sapiens (Human))
BDBM50219414
(CHEMBL79661)
Show SMILES COc1ccc2C(Cc3c(Cl)cncc3Cl)=NN(Cc2c1)S(C)(=O)=O |c:16|
Show InChI InChI=1S/C16H15Cl2N3O3S/c1-24-11-3-4-12-10(5-11)9-21(25(2,22)23)20-16(12)6-13-14(17)7-19-8-15(13)18/h3-5,7-8H,6,9H2,1-2H3
n/an/a 21n/an/an/an/an/an/a
National Institute of Pharmaceutical Education and Research
Curated by ChEMBL
Assay Description
Inhibitory concentration against phosphodiesterase 4.
Bioorg Med Chem Lett 13: 2473-9 (2003)
BindingDB Entry DOI: 10.7270/Q24F1SXB