BDBM50219448 1,1,1-trifluoro-4-(5-fluoro-2-methoxyphenyl)-4-methyl-2-(naphthalen-2-ylmethyl)pentan-2-ol::CHEMBL238044
SMILES: COc1ccc(F)cc1C(C)(C)CC(O)(Cc1ccc2ccccc2c1)C(F)(F)F
InChI Key: InChIKey=MHSIIOXPCQMXQE-UHFFFAOYSA-N
Data: 3 IC50
Activity Spreadsheet -- Enzyme Inhibition Constant Data from BindingDB
Found 3 hits for monomerid = 50219448
Trg + Lig
Ki
nM
ΔG°
kcal/mole
IC50
nM
Kd
nM
EC50/IC50
nM
koff
s-1
kon
M-1s-1
pHTemp
°C
Progesterone receptor
(Homo sapiens (Human))
BDBM50219448
(1,1,1-trifluoro-4-(5-fluoro-2-methoxyphenyl)-4-met...)
Show SMILES COc1ccc(F)cc1C(C)(C)CC(O)(Cc1ccc2ccccc2c1)C(F)(F)F |w:13.14|
Show InChI InChI=1S/C24H24F4O2/c1-22(2,20-13-19(25)10-11-21(20)30-3)15-23(29,24(26,27)28)14-16-8-9-17-6-4-5-7-18(17)12-16/h4-13,29H,14-15H2,1-3H3
n/an/a>2.00E+3n/an/an/an/an/an/a
Boehringer Ingelheim Pharmaceuticals Inc.
Curated by ChEMBL
Assay Description
Displacement of TAMRA labeled Dexamethasone at human progesterone receptor in insect cell
Bioorg Med Chem Lett 17: 5025-31 (2007)
Article DOI: 10.1016/j.bmcl.2007.07.031
BindingDB Entry DOI: 10.7270/Q2G73FJ2
Glucocorticoid receptor
(Homo sapiens (Human))
BDBM50219448
(1,1,1-trifluoro-4-(5-fluoro-2-methoxyphenyl)-4-met...)
Show SMILES COc1ccc(F)cc1C(C)(C)CC(O)(Cc1ccc2ccccc2c1)C(F)(F)F |w:13.14|
Show InChI InChI=1S/C24H24F4O2/c1-22(2,20-13-19(25)10-11-21(20)30-3)15-23(29,24(26,27)28)14-16-8-9-17-6-4-5-7-18(17)12-16/h4-13,29H,14-15H2,1-3H3
n/an/a 275n/an/an/an/an/an/a
Boehringer Ingelheim Pharmaceuticals Inc.
Curated by ChEMBL
Assay Description
Displacement of TAMRA labeled Dexamethasone at human glucocorticoid receptor in insect cell
Bioorg Med Chem Lett 17: 5025-31 (2007)
Article DOI: 10.1016/j.bmcl.2007.07.031
BindingDB Entry DOI: 10.7270/Q2G73FJ2
Mineralocorticoid receptor
(Homo sapiens (Human))
BDBM50219448
(1,1,1-trifluoro-4-(5-fluoro-2-methoxyphenyl)-4-met...)
Show SMILES COc1ccc(F)cc1C(C)(C)CC(O)(Cc1ccc2ccccc2c1)C(F)(F)F |w:13.14|
Show InChI InChI=1S/C24H24F4O2/c1-22(2,20-13-19(25)10-11-21(20)30-3)15-23(29,24(26,27)28)14-16-8-9-17-6-4-5-7-18(17)12-16/h4-13,29H,14-15H2,1-3H3
n/an/a>2.00E+3n/an/an/an/an/an/a
Boehringer Ingelheim Pharmaceuticals Inc.
Curated by ChEMBL
Assay Description
Displacement of TAMRA labeled mifepristone at human mineralocorticoid receptor in insect cell
Bioorg Med Chem Lett 17: 5025-31 (2007)
Article DOI: 10.1016/j.bmcl.2007.07.031
BindingDB Entry DOI: 10.7270/Q2G73FJ2