BDBM50219473 1,1,1-trifluoro-4-(5-fluoro-2-methoxy-phenyl)-4-methyl-2-(3-methyl-benzyl)-pentan-2-ol::CHEMBL236748
SMILES: COc1ccc(F)cc1C(C)(C)CC(O)(Cc1cccc(C)c1)C(F)(F)F
InChI Key: InChIKey=ZVKVUVICAMRYKP-UHFFFAOYSA-N
Data: 3 IC50
Activity Spreadsheet -- Enzyme Inhibition Constant Data from BindingDB
Found 3 hits for monomerid = 50219473
Trg + Lig
Ki
nM
ΔG°
kcal/mole
IC50
nM
Kd
nM
EC50/IC50
nM
koff
s-1
kon
M-1s-1
pHTemp
°C
Glucocorticoid receptor
(Homo sapiens (Human))
BDBM50219473
(1,1,1-trifluoro-4-(5-fluoro-2-methoxy-phenyl)-4-me...)
Show SMILES COc1ccc(F)cc1C(C)(C)CC(O)(Cc1cccc(C)c1)C(F)(F)F |w:13.14|
Show InChI InChI=1S/C21H24F4O2/c1-14-6-5-7-15(10-14)12-20(26,21(23,24)25)13-19(2,3)17-11-16(22)8-9-18(17)27-4/h5-11,26H,12-13H2,1-4H3
n/an/a 580n/an/an/an/an/an/a
Boehringer Ingelheim Pharmaceuticals Inc.
Curated by ChEMBL
Assay Description
Displacement of TAMRA labeled Dexamethasone at human glucocorticoid receptor in insect cell
Bioorg Med Chem Lett 17: 5025-31 (2007)
Article DOI: 10.1016/j.bmcl.2007.07.031
BindingDB Entry DOI: 10.7270/Q2G73FJ2
Progesterone receptor
(Homo sapiens (Human))
BDBM50219473
(1,1,1-trifluoro-4-(5-fluoro-2-methoxy-phenyl)-4-me...)
Show SMILES COc1ccc(F)cc1C(C)(C)CC(O)(Cc1cccc(C)c1)C(F)(F)F |w:13.14|
Show InChI InChI=1S/C21H24F4O2/c1-14-6-5-7-15(10-14)12-20(26,21(23,24)25)13-19(2,3)17-11-16(22)8-9-18(17)27-4/h5-11,26H,12-13H2,1-4H3
n/an/a>1.05E+3n/an/an/an/an/an/a
Boehringer Ingelheim Pharmaceuticals Inc.
Curated by ChEMBL
Assay Description
Displacement of TAMRA labeled Dexamethasone at human progesterone receptor in insect cell
Bioorg Med Chem Lett 17: 5025-31 (2007)
Article DOI: 10.1016/j.bmcl.2007.07.031
BindingDB Entry DOI: 10.7270/Q2G73FJ2
Mineralocorticoid receptor
(Homo sapiens (Human))
BDBM50219473
(1,1,1-trifluoro-4-(5-fluoro-2-methoxy-phenyl)-4-me...)
Show SMILES COc1ccc(F)cc1C(C)(C)CC(O)(Cc1cccc(C)c1)C(F)(F)F |w:13.14|
Show InChI InChI=1S/C21H24F4O2/c1-14-6-5-7-15(10-14)12-20(26,21(23,24)25)13-19(2,3)17-11-16(22)8-9-18(17)27-4/h5-11,26H,12-13H2,1-4H3
n/an/a>1.05E+3n/an/an/an/an/an/a
Boehringer Ingelheim Pharmaceuticals Inc.
Curated by ChEMBL
Assay Description
Displacement of TAMRA labeled mifepristone at human mineralocorticoid receptor in insect cell
Bioorg Med Chem Lett 17: 5025-31 (2007)
Article DOI: 10.1016/j.bmcl.2007.07.031
BindingDB Entry DOI: 10.7270/Q2G73FJ2