null
SMILES: COC(=O)COc1ccc(cn1)C(=O)Nc1ccc(F)cc1
InChI Key: InChIKey=QIBUUCFTHGXSFM-UHFFFAOYSA-N
Activity Spreadsheet -- Enzyme Inhibition Constant Data from BindingDB
Found 1 hit for monomerid = 50219809
Trg + Lig
Ki
nM
ΔG°
kcal/mole
IC50
nM
Kd
nM
EC50/IC50
nM
koff
s-1
kon
M-1s-1
pHTemp
°C
C-X-C chemokine receptor type 1/2
(Homo sapiens (Human))
BDBM50219809
(CHEMBL36643)
Show SMILES COC(=O)COc1ccc(cn1)C(=O)Nc1ccc(F)cc1
Show InChI InChI=1S/C15H13FN2O4/c1-21-14(19)9-22-13-7-2-10(8-17-13)15(20)18-12-5-3-11(16)4-6-12/h2-8H,9H2,1H3,(H,18,20)
n/an/a 110n/an/an/an/an/an/a
Celltech R&D Inc.
Curated by ChEMBL
Assay Description
Inhibition against GRO-alpha driven human neutrophil chemotaxis
Bioorg Med Chem Lett 12: 1517-20 (2002)
BindingDB Entry DOI: 10.7270/Q2JM28ZD