BDBM50219981 CHEMBL298834
SMILES: OC(=O)C(F)(F)F.[H][C@@](N)([C@H](O)CO)[C@]1([H])OC(=C[C@H](NC(N)=N)[C@H]1NC(C)=O)C(O)=O
InChI Key: InChIKey=DQUPXJPWBBJBMZ-LUTUWXHWSA-N
Data: 1 IC50
Activity Spreadsheet -- Enzyme Inhibition Constant Data from BindingDB
Found 1 hit for monomerid = 50219981
Trg + Lig
Ki
nM
ΔG°
kcal/mole
IC50
nM
Kd
nM
EC50/IC50
nM
koff
s-1
kon
M-1s-1
pHTemp
°C
Neuraminidase
(Influenza A virus (A/Puerto Rico/8/34/Mount Sinai(...)
BDBM50219981
(CHEMBL298834)
Show SMILES OC(=O)C(F)(F)F.[H][C@@](N)([C@H](O)CO)[C@]1([H])OC(=C[C@H](NC(N)=N)[C@H]1NC(C)=O)C(O)=O |c:16|
Show InChI InChI=1S/C12H21N5O6/c1-4(19)16-9-5(17-12(14)15)2-7(11(21)22)23-10(9)8(13)6(20)3-18/h2,5-6,8-10,18,20H,3,13H2,1H3,(H,16,19)(H,21,22)(H4,14,15,17)/t5-,6+,8+,9+,10-/m0/s1
n/an/a 37n/an/an/an/an/an/a
Sankyo Co., Ltd.
Curated by ChEMBL
Assay Description
Inhibition of sialidase activity
Bioorg Med Chem Lett 12: 1921-4 (2002)
BindingDB Entry DOI: 10.7270/Q2W37ZHP