BDBM50219984 CHEMBL299915
SMILES: OC(=O)C(F)(F)F.[H][C@@](N=[N+]=[N-])([C@H](O)CO)[C@]1([H])OC(=C[C@H](NC(N)=N)[C@H]1NC(C)=O)C(O)=O
InChI Key: InChIKey=WBRKSUZUTOIKFH-UFGQHTETSA-N
Data: 1 IC50
Activity Spreadsheet -- Enzyme Inhibition Constant Data from BindingDB
Found 1 hit for monomerid = 50219984
Trg + Lig
Ki
nM
ΔG°
kcal/mole
IC50
nM
Kd
nM
EC50/IC50
nM
koff
s-1
kon
M-1s-1
pHTemp
°C
Neuraminidase
(Influenza A virus (A/Puerto Rico/8/34/Mount Sinai(...)
BDBM50219984
(CHEMBL299915)
Show SMILES OC(=O)C(F)(F)F.[H][C@@](N=[N+]=[N-])([C@H](O)CO)[C@]1([H])OC(=C[C@H](NC(N)=N)[C@H]1NC(C)=O)C(O)=O |c:18|
Show InChI InChI=1S/C12H19N7O6/c1-4(21)16-8-5(17-12(13)14)2-7(11(23)24)25-10(8)9(18-19-15)6(22)3-20/h2,5-6,8-10,20,22H,3H2,1H3,(H,16,21)(H,23,24)(H4,13,14,17)/t5-,6+,8+,9+,10+/m0/s1
n/an/a 1.60n/an/an/an/an/an/a
Sankyo Co., Ltd.
Curated by ChEMBL
Assay Description
Inhibition of sialidase activity
Bioorg Med Chem Lett 12: 1921-4 (2002)
BindingDB Entry DOI: 10.7270/Q2W37ZHP