BDBM50220003 CHEMBL56664
SMILES: [#8]-[#6](=O)C(F)(F)F.[H][C@]1([#8]-[#6](=[#6]-[#6@H](\[#7]=[#6](/[#7])-[#7])-[#6@H]1-[#7]-[#6](-[#6])=O)-[#6](-[#8])=O)[#6@@H](-[#6]-[#6])-[#8]-[#6]-[#6]-[#6]-[#6]-[#6]-[#6]-[#6]-[#6]
InChI Key: InChIKey=KHKMSELTEQHSSL-IDCNUPLLSA-N
Data: 1 IC50
Activity Spreadsheet -- Enzyme Inhibition Constant Data from BindingDB
Found 1 hit for monomerid = 50220003
Trg + Lig
Ki
nM
ΔG°
kcal/mole
IC50
nM
Kd
nM
EC50/IC50
nM
koff
s-1
kon
M-1s-1
pHTemp
°C
Neuraminidase
(Influenza A virus (A/Puerto Rico/8/34/Mount Sinai(...)
BDBM50220003
(CHEMBL56664)
Show SMILES [#8]-[#6](=O)C(F)(F)F.[H][C@]1([#8]-[#6](=[#6]-[#6@H](\[#7]=[#6](/[#7])-[#7])-[#6@H]1-[#7]-[#6](-[#6])=O)-[#6](-[#8])=O)[#6@@H](-[#6]-[#6])-[#8]-[#6]-[#6]-[#6]-[#6]-[#6]-[#6]-[#6]-[#6] |c:9|
Show InChI InChI=1S/C20H36N4O5/c1-4-6-7-8-9-10-11-28-15(5-2)18-17(23-13(3)25)14(24-20(21)22)12-16(29-18)19(26)27/h12,14-15,17-18H,4-11H2,1-3H3,(H,23,25)(H,26,27)(H4,21,22,24)/t14-,15+,17+,18-/m0/s1
n/an/a 17n/an/an/an/an/an/a
Sankyo Co., Ltd.
Curated by ChEMBL
Assay Description
Inhibition of influenza A sialidase in vitro.
Bioorg Med Chem Lett 12: 1925-8 (2002)
BindingDB Entry DOI: 10.7270/Q2RB76SB