BDBM50220088 3-methoxy-5-(pyrido[2,3-d]pyrimidin-2-yl)benzonitrile::CHEMBL239198
SMILES: COc1cc(cc(c1)-c1ncc2cccnc2n1)C#N
InChI Key: InChIKey=MWBCTOHVIBIQOC-UHFFFAOYSA-N
Data: 1 IC50
Activity Spreadsheet -- Enzyme Inhibition Constant Data from BindingDB
Found 1 hit for monomerid = 50220088
Trg + Lig
Ki
nM
ΔG°
kcal/mole
IC50
nM
Kd
nM
EC50/IC50
nM
koff
s-1
kon
M-1s-1
pHTemp
°C
Metabotropic glutamate receptor
(Rattus norvegicus (Rat))
BDBM50220088
(3-methoxy-5-(pyrido[2,3-d]pyrimidin-2-yl)benzonitr...)
Show SMILES COc1cc(cc(c1)-c1ncc2cccnc2n1)C#N
Show InChI InChI=1S/C15H10N4O/c1-20-13-6-10(8-16)5-12(7-13)15-18-9-11-3-2-4-17-14(11)19-15/h2-7,9H,1H3
Reactome pathway
n/an/a 4.95n/an/an/an/an/an/a
Pfizer Global Research & Development
Curated by ChEMBL
Assay Description
Antagonistic activity at rat mGluR5 expressed in CHO cells assessed as inhibition of quisqualate stimulated calcium mobilization by FLIPR technology
Bioorg Med Chem Lett 17: 5396-9 (2007)
Article DOI: 10.1016/j.bmcl.2007.07.047
BindingDB Entry DOI: 10.7270/Q2JH3KWK