BDBM50220121 (3R,4S)-N-(2-(3,5-bis(trifluoromethyl)phenyl)propan-2-yl)-1-(1-acetylpiperidine-4-carbonyl)-4-(4-fluoro-2-methylphenyl)-N-methylpyrrolidine-3-carboxamide::CHEMBL391615
SMILES: CN(C(=O)[C@H]1CN(C[C@@H]1c1ccc(F)cc1C)C(=O)C1CCN(CC1)C(C)=O)C(C)(C)c1cc(cc(c1)C(F)(F)F)C(F)(F)F
InChI Key: InChIKey=QXYXAFHTANBIQX-SXOMAYOGSA-N
Data: 5 IC50
Activity Spreadsheet -- Enzyme Inhibition Constant Data from BindingDB
Found 5 hits for monomerid = 50220121
Trg + Lig
Ki
nM
ΔG°
kcal/mole
IC50
nM
Kd
nM
EC50/IC50
nM
koff
s-1
kon
M-1s-1
pHTemp
°C
Neurokinin 1 receptor
(Homo sapiens (Human))
BDBM50220121
((3R,4S)-N-(2-(3,5-bis(trifluoromethyl)phenyl)propa...)
Show SMILES CN(C(=O)[C@H]1CN(C[C@@H]1c1ccc(F)cc1C)C(=O)C1CCN(CC1)C(C)=O)C(C)(C)c1cc(cc(c1)C(F)(F)F)C(F)(F)F
Show InChI InChI=1S/C32H36F7N3O3/c1-18-12-24(33)6-7-25(18)26-16-42(28(44)20-8-10-41(11-9-20)19(2)43)17-27(26)29(45)40(5)30(3,4)21-13-22(31(34,35)36)15-23(14-21)32(37,38)39/h6-7,12-15,20,26-27H,8-11,16-17H2,1-5H3/t26-,27+/m1/s1
Reactome pathway
n/an/a 0.0500n/an/an/an/an/an/a
Merck Research Laboratories
Curated by ChEMBL
Assay Description
Displacement of [125I]SP from human NK1 receptor expressed in CHO cells
Bioorg Med Chem Lett 17: 5310-5 (2007)
Article DOI: 10.1016/j.bmcl.2007.08.028
BindingDB Entry DOI: 10.7270/Q2DR2V75
Cytochrome P450 3A4
(Homo sapiens (Human))
BDBM50220121
((3R,4S)-N-(2-(3,5-bis(trifluoromethyl)phenyl)propa...)
Show SMILES CN(C(=O)[C@H]1CN(C[C@@H]1c1ccc(F)cc1C)C(=O)C1CCN(CC1)C(C)=O)C(C)(C)c1cc(cc(c1)C(F)(F)F)C(F)(F)F
Show InChI InChI=1S/C32H36F7N3O3/c1-18-12-24(33)6-7-25(18)26-16-42(28(44)20-8-10-41(11-9-20)19(2)43)17-27(26)29(45)40(5)30(3,4)21-13-22(31(34,35)36)15-23(14-21)32(37,38)39/h6-7,12-15,20,26-27H,8-11,16-17H2,1-5H3/t26-,27+/m1/s1
Reactome pathway
n/an/a 4.90E+4n/an/an/an/an/an/a
Merck Research Laboratories
Curated by ChEMBL
Assay Description
Inhibition of human CYP3A4
Bioorg Med Chem Lett 17: 5310-5 (2007)
Article DOI: 10.1016/j.bmcl.2007.08.028
BindingDB Entry DOI: 10.7270/Q2DR2V75
Cytochrome P450 2D6
(Homo sapiens (Human))
BDBM50220121
((3R,4S)-N-(2-(3,5-bis(trifluoromethyl)phenyl)propa...)
Show SMILES CN(C(=O)[C@H]1CN(C[C@@H]1c1ccc(F)cc1C)C(=O)C1CCN(CC1)C(C)=O)C(C)(C)c1cc(cc(c1)C(F)(F)F)C(F)(F)F
Show InChI InChI=1S/C32H36F7N3O3/c1-18-12-24(33)6-7-25(18)26-16-42(28(44)20-8-10-41(11-9-20)19(2)43)17-27(26)29(45)40(5)30(3,4)21-13-22(31(34,35)36)15-23(14-21)32(37,38)39/h6-7,12-15,20,26-27H,8-11,16-17H2,1-5H3/t26-,27+/m1/s1
n/an/a 5.70E+4n/an/an/an/an/an/a
Merck Research Laboratories
Curated by ChEMBL
Assay Description
Inhibition of human CYP2D6
Bioorg Med Chem Lett 17: 5310-5 (2007)
Article DOI: 10.1016/j.bmcl.2007.08.028
BindingDB Entry DOI: 10.7270/Q2DR2V75
Neurokinin 1 receptor
(Homo sapiens (Human))
BDBM50220121
((3R,4S)-N-(2-(3,5-bis(trifluoromethyl)phenyl)propa...)
Show SMILES CN(C(=O)[C@H]1CN(C[C@@H]1c1ccc(F)cc1C)C(=O)C1CCN(CC1)C(C)=O)C(C)(C)c1cc(cc(c1)C(F)(F)F)C(F)(F)F
Show InChI InChI=1S/C32H36F7N3O3/c1-18-12-24(33)6-7-25(18)26-16-42(28(44)20-8-10-41(11-9-20)19(2)43)17-27(26)29(45)40(5)30(3,4)21-13-22(31(34,35)36)15-23(14-21)32(37,38)39/h6-7,12-15,20,26-27H,8-11,16-17H2,1-5H3/t26-,27+/m1/s1
Reactome pathway
n/an/a 0.510n/an/an/an/an/an/a
Merck Research Laboratories
Curated by ChEMBL
Assay Description
Displacement of [125I]SP from human NK1 receptor expressed in CHO cells in presence of 50% human serum
Bioorg Med Chem Lett 17: 5310-5 (2007)
Article DOI: 10.1016/j.bmcl.2007.08.028
BindingDB Entry DOI: 10.7270/Q2DR2V75
Cytochrome P450 2C9
(Homo sapiens (Human))
BDBM50220121
((3R,4S)-N-(2-(3,5-bis(trifluoromethyl)phenyl)propa...)
Show SMILES CN(C(=O)[C@H]1CN(C[C@@H]1c1ccc(F)cc1C)C(=O)C1CCN(CC1)C(C)=O)C(C)(C)c1cc(cc(c1)C(F)(F)F)C(F)(F)F
Show InChI InChI=1S/C32H36F7N3O3/c1-18-12-24(33)6-7-25(18)26-16-42(28(44)20-8-10-41(11-9-20)19(2)43)17-27(26)29(45)40(5)30(3,4)21-13-22(31(34,35)36)15-23(14-21)32(37,38)39/h6-7,12-15,20,26-27H,8-11,16-17H2,1-5H3/t26-,27+/m1/s1
Reactome pathway
n/an/a>1.00E+5n/an/an/an/an/an/a
Merck Research Laboratories
Curated by ChEMBL
Assay Description
Inhibition of human CYP2C9
Bioorg Med Chem Lett 17: 5310-5 (2007)
Article DOI: 10.1016/j.bmcl.2007.08.028
BindingDB Entry DOI: 10.7270/Q2DR2V75