BDBM50220124 1-(4-((3S,4R)-3-(5-(2-(3,5-bis(trifluoromethyl)phenyl)propan-2-yl)-1,2,4-oxadiazol-3-yl)-4-(4-fluoro-2-methylphenyl)pyrrolidine-1-carbonyl)piperidin-1-yl)ethanone::CHEMBL392466
SMILES: CC(=O)N1CCC(CC1)C(=O)N1C[C@H]([C@@H](C1)c1ccc(F)cc1C)c1noc(n1)C(C)(C)c1cc(cc(c1)C(F)(F)F)C(F)(F)F
InChI Key: InChIKey=VCENFKCGBAWAEQ-IZZNHLLZSA-N
Data: 2 IC50
Activity Spreadsheet -- Enzyme Inhibition Constant Data from BindingDB
Found 2 hits for monomerid = 50220124
Trg + Lig
Ki
nM
ΔG°
kcal/mole
IC50
nM
Kd
nM
EC50/IC50
nM
koff
s-1
kon
M-1s-1
pHTemp
°C
Neurokinin 1 receptor
(Homo sapiens (Human))
BDBM50220124
(1-(4-((3S,4R)-3-(5-(2-(3,5-bis(trifluoromethyl)phe...)
Show SMILES CC(=O)N1CCC(CC1)C(=O)N1C[C@H]([C@@H](C1)c1ccc(F)cc1C)c1noc(n1)C(C)(C)c1cc(cc(c1)C(F)(F)F)C(F)(F)F
Show InChI InChI=1S/C32H33F7N4O3/c1-17-11-23(33)5-6-24(17)25-15-43(28(45)19-7-9-42(10-8-19)18(2)44)16-26(25)27-40-29(46-41-27)30(3,4)20-12-21(31(34,35)36)14-22(13-20)32(37,38)39/h5-6,11-14,19,25-26H,7-10,15-16H2,1-4H3/t25-,26+/m0/s1
Reactome pathway
n/an/a 0.0300n/an/an/an/an/an/a
Merck Research Laboratories
Curated by ChEMBL
Assay Description
Displacement of [125I]SP from human NK1 receptor expressed in CHO cells
Bioorg Med Chem Lett 17: 5310-5 (2007)
Article DOI: 10.1016/j.bmcl.2007.08.028
BindingDB Entry DOI: 10.7270/Q2DR2V75
Neurokinin 1 receptor
(Homo sapiens (Human))
BDBM50220124
(1-(4-((3S,4R)-3-(5-(2-(3,5-bis(trifluoromethyl)phe...)
Show SMILES CC(=O)N1CCC(CC1)C(=O)N1C[C@H]([C@@H](C1)c1ccc(F)cc1C)c1noc(n1)C(C)(C)c1cc(cc(c1)C(F)(F)F)C(F)(F)F
Show InChI InChI=1S/C32H33F7N4O3/c1-17-11-23(33)5-6-24(17)25-15-43(28(45)19-7-9-42(10-8-19)18(2)44)16-26(25)27-40-29(46-41-27)30(3,4)20-12-21(31(34,35)36)14-22(13-20)32(37,38)39/h5-6,11-14,19,25-26H,7-10,15-16H2,1-4H3/t25-,26+/m0/s1
Reactome pathway
n/an/a 0.170n/an/an/an/an/an/a
Merck Research Laboratories
Curated by ChEMBL
Assay Description
Displacement of [125I]SP from human NK1 receptor expressed in CHO cells in presence of 50% human serum
Bioorg Med Chem Lett 17: 5310-5 (2007)
Article DOI: 10.1016/j.bmcl.2007.08.028
BindingDB Entry DOI: 10.7270/Q2DR2V75