null
SMILES: NS(=O)(=O)Nc1ccc(cc1)-c1ccc2OC(F)(F)Oc2c1
InChI Key: InChIKey=HCMBBXMRRNPAOR-UHFFFAOYSA-N
Activity Spreadsheet -- Enzyme Inhibition Constant Data from BindingDB
Found 1 hit for monomerid = 50220176
Trg + Lig
Ki
nM
ΔG°
kcal/mole
IC50
nM
Kd
nM
EC50/IC50
nM
koff
s-1
kon
M-1s-1
pHTemp
°C
Kinesin-like protein KIF11
(Homo sapiens (Human))
BDBM50220176
(CHEMBL242181 | N-[4-(2,2-difluoro-1,3-benzodioxol-...)
Show SMILES NS(=O)(=O)Nc1ccc(cc1)-c1ccc2OC(F)(F)Oc2c1
Show InChI InChI=1S/C13H10F2N2O4S/c14-13(15)20-11-6-3-9(7-12(11)21-13)8-1-4-10(5-2-8)17-22(16,18)19/h1-7,17H,(H2,16,18,19)
Reactome pathway
n/an/a 31n/an/an/an/an/an/a
GlaxoSmithKline
Curated by ChEMBL
Assay Description
Inhibition of human KSP motor domain by ATPase assay
J Med Chem 50: 4939-52 (2007)
Article DOI: 10.1021/jm070435y
BindingDB Entry DOI: 10.7270/Q29023H4