BDBM50220849 4-fluoro-5-methyl-1H-pyrazole-3-carboxylic acid::CHEMBL238004
SMILES: Cc1[nH]nc(C(O)=O)c1F
InChI Key: InChIKey=GCCITEYZWDUSEN-UHFFFAOYSA-N
Data: 2 EC50
Activity Spreadsheet -- Enzyme Inhibition Constant Data from BindingDB
Found 2 hits for monomerid = 50220849
Trg + Lig
Ki
nM
ΔG°
kcal/mole
IC50
nM
Kd
nM
EC50/IC50
nM
koff
s-1
kon
M-1s-1
pHTemp
°C
Hydroxycarboxylic acid receptor 2
(Homo sapiens (Human))
BDBM50220849
(4-fluoro-5-methyl-1H-pyrazole-3-carboxylic acid | ...)
Show SMILES Cc1[nH]nc(C(O)=O)c1F
Show InChI InChI=1S/C5H5FN2O2/c1-2-3(6)4(5(9)10)8-7-2/h1H3,(H,7,8)(H,9,10)
Reactome pathway
n/an/an/an/a 42n/an/an/an/a
Arena Pharmaceuticals
Curated by ChEMBL
Assay Description
Agonist activity at human GPR109a expressed in human adipocytes assessed as decrease in intracellular cAMP level by HTRF assay
Bioorg Med Chem Lett 17: 5620-3 (2007)
Checked by Author
Article DOI: 10.1016/j.bmcl.2007.07.101
BindingDB Entry DOI: 10.7270/Q2TT4QN2
Hydroxycarboxylic acid receptor 2
(Homo sapiens (Human))
BDBM50220849
(4-fluoro-5-methyl-1H-pyrazole-3-carboxylic acid | ...)
Show SMILES Cc1[nH]nc(C(O)=O)c1F
Show InChI InChI=1S/C5H5FN2O2/c1-2-3(6)4(5(9)10)8-7-2/h1H3,(H,7,8)(H,9,10)
Reactome pathway
n/an/an/an/a 42n/an/an/an/a
Arena Pharmaceuticals
Curated by ChEMBL
Assay Description
Agonist activity at human GPR109a expressed in human adipocytes assessed as decrease in intracellular cAMP level by HTRF assay
Bioorg Med Chem Lett 17: 5620-3 (2007)
Checked by Author
Article DOI: 10.1016/j.bmcl.2007.07.101
BindingDB Entry DOI: 10.7270/Q2TT4QN2