BDBM50221037 CHEMBL87262
SMILES: Oc1c2SCCc2nn1-c1ccc(Br)cc1
InChI Key: InChIKey=YJUYHUKZHDBCAG-UHFFFAOYSA-N
Data: 3 IC50
Activity Spreadsheet -- Enzyme Inhibition Constant Data from BindingDB
Found 3 hits for monomerid = 50221037
Trg + Lig
Ki
nM
ΔG°
kcal/mole
IC50
nM
Kd
nM
EC50/IC50
nM
koff
s-1
kon
M-1s-1
pHTemp
°C
MurD (S. aureus)
(Staphylococcus aureus (Firmicutes))
BDBM50221037
(CHEMBL87262)
Show SMILES Oc1c2SCCc2nn1-c1ccc(Br)cc1
Show InChI InChI=1S/C11H9BrN2OS/c12-7-1-3-8(4-2-7)14-11(15)10-9(13-14)5-6-16-10/h1-4,15H,5-6H2
n/an/a 3.02E+4n/an/an/an/an/an/a
Wyeth Research
Curated by ChEMBL
Assay Description
In vitro inhibitory activity against Staphylococcus aureus UDP-N-acetylmuramoyl-L-alanyl-D-glutamate synthetase
Bioorg Med Chem Lett 13: 2591-4 (2003)
BindingDB Entry DOI: 10.7270/Q20P126D
MurC (S. aureus)
(Staphylococcus aureus (Firmicutes))
BDBM50221037
(CHEMBL87262)
Show SMILES Oc1c2SCCc2nn1-c1ccc(Br)cc1
Show InChI InChI=1S/C11H9BrN2OS/c12-7-1-3-8(4-2-7)14-11(15)10-9(13-14)5-6-16-10/h1-4,15H,5-6H2
n/an/a 3.70E+4n/an/an/an/an/an/a
Wyeth Research
Curated by ChEMBL
Assay Description
In vitro inhibitory activity against Staphylococcus aureus UDP-N-acetylmuramoyl-L-alanine synthetase
Bioorg Med Chem Lett 13: 2591-4 (2003)
BindingDB Entry DOI: 10.7270/Q20P126D
MurB (S. aureus)
(Staphylococcus aureus (Firmicutes))
BDBM50221037
(CHEMBL87262)
Show SMILES Oc1c2SCCc2nn1-c1ccc(Br)cc1
Show InChI InChI=1S/C11H9BrN2OS/c12-7-1-3-8(4-2-7)14-11(15)10-9(13-14)5-6-16-10/h1-4,15H,5-6H2
n/an/a 1.21E+4n/an/an/an/an/an/a
Wyeth Research
Curated by ChEMBL
Assay Description
In vitro inhibitory activity against Staphylococcus aureus UDP-N-acetylmuramate dehydrogenase
Bioorg Med Chem Lett 13: 2591-4 (2003)
BindingDB Entry DOI: 10.7270/Q20P126D