BDBM50221041 CHEMBL83458
SMILES: Oc1c2COCc2nn1-c1ccc(Cl)cc1
InChI Key: InChIKey=USAPWTXREZBRNI-UHFFFAOYSA-N
Data: 1 IC50
Activity Spreadsheet -- Enzyme Inhibition Constant Data from BindingDB
Found 1 hit for monomerid = 50221041
Trg + Lig
Ki
nM
ΔG°
kcal/mole
IC50
nM
Kd
nM
EC50/IC50
nM
koff
s-1
kon
M-1s-1
pHTemp
°C
MurB (S. aureus)
(Staphylococcus aureus (Firmicutes))
BDBM50221041
(CHEMBL83458)
Show SMILES Oc1c2COCc2nn1-c1ccc(Cl)cc1
Show InChI InChI=1S/C11H9ClN2O2/c12-7-1-3-8(4-2-7)14-11(15)9-5-16-6-10(9)13-14/h1-4,15H,5-6H2
n/an/a>1.05E+5n/an/an/an/an/an/a
Wyeth Research
Curated by ChEMBL
Assay Description
In vitro inhibitory activity against Staphylococcus aureus UDP-N-acetylmuramate dehydrogenase
Bioorg Med Chem Lett 13: 2591-4 (2003)
BindingDB Entry DOI: 10.7270/Q20P126D