BDBM50221063 (1S,2S,12bS,12cS)-1,2-Diol-2,4,5,7, 12b,12c-hexahydro-1H-[1,3]dioxolo[4,5-j]pyrrolo[3,2,1-de]phenanthridine-1-acetate::1-Acetoxylycorine::1-Acetyllycorine::1-O-Acetyllycorine::CHEMBL251077::acetic acid (1S,2S,12bS,12cS)-2-hydroxy-1,2,4,5,12b,12c-hexahydro-7H-[1,3]dioxolo[4,5-j]pyrrolo[3,2,1-de]phenanthridin-1-yl ester
SMILES: CC(=O)O[C@@H]1[C@@H](O)C=C2CCN3Cc4cc5OCOc5cc4[C@H]1[C@@H]23
InChI Key: InChIKey=BIGUPJIJZYZJMV-VIBAHUMZSA-N
Data: 2 KI  1 IC50
Activity Spreadsheet -- Enzyme Inhibition Constant Data from BindingDB
Found 3 hits for monomerid = 50221063
Trg + Lig
Ki
nM
ΔG°
kcal/mole
IC50
nM
Kd
nM
EC50/IC50
nM
koff
s-1
kon
M-1s-1
pHTemp
°C
Acetylcholinesterase
(Homo sapiens (Human))
BDBM50221063
((1S,2S,12bS,12cS)-1,2-Diol-2,4,5,7, 12b,12c-hexahy...)
Show SMILES CC(=O)O[C@@H]1[C@@H](O)C=C2CCN3Cc4cc5OCOc5cc4[C@H]1[C@@H]23 |r,t:7|
Show InChI InChI=1S/C18H19NO5/c1-9(20)24-18-13(21)4-10-2-3-19-7-11-5-14-15(23-8-22-14)6-12(11)16(18)17(10)19/h4-6,13,16-18,21H,2-3,7-8H2,1H3/t13-,16-,17+,18+/m0/s1
NCI pathway
Reactome pathway
430n/an/an/an/an/an/an/an/a
McMaster University
Curated by ChEMBL
Assay Description
Inhibition of AChE by Ellman's assay
Bioorg Med Chem Lett 20: 5290-4 (2010)
Article DOI: 10.1016/j.bmcl.2010.06.130
BindingDB Entry DOI: 10.7270/Q2CN7437
Cytochrome P450 3A4
(Homo sapiens (Human))
BDBM50221063
((1S,2S,12bS,12cS)-1,2-Diol-2,4,5,7, 12b,12c-hexahy...)
Show SMILES CC(=O)O[C@@H]1[C@@H](O)C=C2CCN3Cc4cc5OCOc5cc4[C@H]1[C@@H]23 |r,t:7|
Show InChI InChI=1S/C18H19NO5/c1-9(20)24-18-13(21)4-10-2-3-19-7-11-5-14-15(23-8-22-14)6-12(11)16(18)17(10)19/h4-6,13,16-18,21H,2-3,7-8H2,1H3/t13-,16-,17+,18+/m0/s1
Reactome pathway
7.60E+3n/an/an/an/an/an/an/an/a
McMaster University
Curated by ChEMBL
Assay Description
Inhibition of human CYP3A4 assessed as biotransformation of 7-benzyloxyquinoline
Bioorg Med Chem Lett 19: 3233-7 (2009)
Article DOI: 10.1016/j.bmcl.2009.04.086
BindingDB Entry DOI: 10.7270/Q2X92BBG
Acetylcholinesterase
(Homo sapiens (Human))
BDBM50221063
((1S,2S,12bS,12cS)-1,2-Diol-2,4,5,7, 12b,12c-hexahy...)
Show SMILES CC(=O)O[C@@H]1[C@@H](O)C=C2CCN3Cc4cc5OCOc5cc4[C@H]1[C@@H]23 |r,t:7|
Show InChI InChI=1S/C18H19NO5/c1-9(20)24-18-13(21)4-10-2-3-19-7-11-5-14-15(23-8-22-14)6-12(11)16(18)17(10)19/h4-6,13,16-18,21H,2-3,7-8H2,1H3/t13-,16-,17+,18+/m0/s1
NCI pathway
Reactome pathway
n/an/a 960n/an/an/an/an/an/a
Chinese Academy of Sciences
Curated by ChEMBL
Assay Description
Inhibition of AChE by Ellman method
J Nat Prod 70: 1458-61 (2007)
Article DOI: 10.1021/np0702077
BindingDB Entry DOI: 10.7270/Q2MK6DQQ