BDBM50221132 CHEMBL412024::N-((S)-1-(2-(4-((R)-3-(2,4-dichlorophenyl)-2-(2-oxopyrrolidin-1-yl)propanoyl)piperazin-1-yl)-5-fluorophenyl)-3-methylbutyl)-2-(dimethylamino)acetamide
SMILES: CC(C)C[C@H](NC(=O)CN(C)C)c1cc(F)ccc1N1CCN(CC1)C(=O)[C@@H](Cc1ccc(Cl)cc1Cl)N1CCCC1=O
InChI Key: InChIKey=JZDBOFKXYADYQD-LMSSTIIKSA-N
Data: 1 KI  1 IC50
Activity Spreadsheet -- Enzyme Inhibition Constant Data from BindingDB
Found 2 hits for monomerid = 50221132
Trg + Lig
Ki
nM
ΔG°
kcal/mole
IC50
nM
Kd
nM
EC50/IC50
nM
koff
s-1
kon
M-1s-1
pHTemp
°C
Melanocortin receptor 4
(Homo sapiens (Human))
BDBM50221132
(CHEMBL412024 | N-((S)-1-(2-(4-((R)-3-(2,4-dichloro...)
Show SMILES CC(C)C[C@H](NC(=O)CN(C)C)c1cc(F)ccc1N1CCN(CC1)C(=O)[C@@H](Cc1ccc(Cl)cc1Cl)N1CCCC1=O
Show InChI InChI=1S/C32H42Cl2FN5O3/c1-21(2)16-27(36-30(41)20-37(3)4)25-19-24(35)9-10-28(25)38-12-14-39(15-13-38)32(43)29(40-11-5-6-31(40)42)17-22-7-8-23(33)18-26(22)34/h7-10,18-19,21,27,29H,5-6,11-17,20H2,1-4H3,(H,36,41)/t27-,29+/m0/s1
23n/an/an/an/an/an/an/an/a
Neurocrine Biosciences, Inc.
Curated by ChEMBL
Assay Description
Binding affinity at human MC4R
Bioorg Med Chem Lett 17: 5610-3 (2007)
Article DOI: 10.1016/j.bmcl.2007.07.097
BindingDB Entry DOI: 10.7270/Q2XK8F8V
Cytochrome P450 3A4
(Homo sapiens (Human))
BDBM50221132
(CHEMBL412024 | N-((S)-1-(2-(4-((R)-3-(2,4-dichloro...)
Show SMILES CC(C)C[C@H](NC(=O)CN(C)C)c1cc(F)ccc1N1CCN(CC1)C(=O)[C@@H](Cc1ccc(Cl)cc1Cl)N1CCCC1=O
Show InChI InChI=1S/C32H42Cl2FN5O3/c1-21(2)16-27(36-30(41)20-37(3)4)25-19-24(35)9-10-28(25)38-12-14-39(15-13-38)32(43)29(40-11-5-6-31(40)42)17-22-7-8-23(33)18-26(22)34/h7-10,18-19,21,27,29H,5-6,11-17,20H2,1-4H3,(H,36,41)/t27-,29+/m0/s1
Reactome pathway
n/an/a 1.50E+4n/an/an/an/an/an/a
Neurocrine Biosciences, Inc.
Curated by ChEMBL
Assay Description
Inhibition of microsomal CYP3A4
Bioorg Med Chem Lett 17: 5610-3 (2007)
Article DOI: 10.1016/j.bmcl.2007.07.097
BindingDB Entry DOI: 10.7270/Q2XK8F8V