BDBM50221146 1-((R)-1-(4-(2-((S)-1-(2-aminoethylamino)-3-methylbutyl)-4-fluorophenyl)piperazin-1-yl)-3-(2,4-dichlorophenyl)-1-oxopropan-2-yl)pyrrolidin-2-one::CHEMBL237364
SMILES: CC(C)C[C@H](NCCN)c1cc(F)ccc1N1CCN(CC1)C(=O)[C@@H](Cc1ccc(Cl)cc1Cl)N1CCCC1=O
InChI Key: InChIKey=PZLVUHVHOCIJNX-XTEPFMGCSA-N
Data: 1 KI  1 IC50
Activity Spreadsheet -- Enzyme Inhibition Constant Data from BindingDB
Found 2 hits for monomerid = 50221146
Trg + Lig
Ki
nM
ΔG°
kcal/mole
IC50
nM
Kd
nM
EC50/IC50
nM
koff
s-1
kon
M-1s-1
pHTemp
°C
Melanocortin receptor 4
(Homo sapiens (Human))
BDBM50221146
(1-((R)-1-(4-(2-((S)-1-(2-aminoethylamino)-3-methyl...)
Show SMILES CC(C)C[C@H](NCCN)c1cc(F)ccc1N1CCN(CC1)C(=O)[C@@H](Cc1ccc(Cl)cc1Cl)N1CCCC1=O
Show InChI InChI=1S/C30H40Cl2FN5O2/c1-20(2)16-26(35-10-9-34)24-19-23(33)7-8-27(24)36-12-14-37(15-13-36)30(40)28(38-11-3-4-29(38)39)17-21-5-6-22(31)18-25(21)32/h5-8,18-20,26,28,35H,3-4,9-17,34H2,1-2H3/t26-,28+/m0/s1
60n/an/an/an/an/an/an/an/a
Neurocrine Biosciences, Inc.
Curated by ChEMBL
Assay Description
Binding affinity at human MC4R
Bioorg Med Chem Lett 17: 5610-3 (2007)
Article DOI: 10.1016/j.bmcl.2007.07.097
BindingDB Entry DOI: 10.7270/Q2XK8F8V
Cytochrome P450 3A4
(Homo sapiens (Human))
BDBM50221146
(1-((R)-1-(4-(2-((S)-1-(2-aminoethylamino)-3-methyl...)
Show SMILES CC(C)C[C@H](NCCN)c1cc(F)ccc1N1CCN(CC1)C(=O)[C@@H](Cc1ccc(Cl)cc1Cl)N1CCCC1=O
Show InChI InChI=1S/C30H40Cl2FN5O2/c1-20(2)16-26(35-10-9-34)24-19-23(33)7-8-27(24)36-12-14-37(15-13-36)30(40)28(38-11-3-4-29(38)39)17-21-5-6-22(31)18-25(21)32/h5-8,18-20,26,28,35H,3-4,9-17,34H2,1-2H3/t26-,28+/m0/s1
Reactome pathway
n/an/a 8.90E+3n/an/an/an/an/an/a
Neurocrine Biosciences, Inc.
Curated by ChEMBL
Assay Description
Inhibition of microsomal CYP3A4
Bioorg Med Chem Lett 17: 5610-3 (2007)
Article DOI: 10.1016/j.bmcl.2007.07.097
BindingDB Entry DOI: 10.7270/Q2XK8F8V