BDBM50221229 3-(1-(2-hydroxy-3-(5-(methylsulfonyl)-3-(4-(trifluoromethyl)phenyl)-4,5,6,7-tetrahydropyrazolo[4,3-c]pyridin-1-yl)propyl)piperidin-4-yl)-1H-indole-5-carbonitrile::CHEMBL235207
SMILES: CS(=O)(=O)N1CCc2c(C1)c(nn2CC(O)CN1CCC(CC1)c1c[nH]c2ccc(cc12)C#N)-c1ccc(cc1)C(F)(F)F
InChI Key: InChIKey=NIINAQIZMZPQPH-UHFFFAOYSA-N
Data: 1 IC50
Activity Spreadsheet -- Enzyme Inhibition Constant Data from BindingDB
Found 1 hit for monomerid = 50221229
Trg + Lig
Ki
nM
ΔG°
kcal/mole
IC50
nM
Kd
nM
EC50/IC50
nM
koff
s-1
kon
M-1s-1
pHTemp
°C
Cathepsin S
(Homo sapiens (Human))
BDBM50221229
(3-(1-(2-hydroxy-3-(5-(methylsulfonyl)-3-(4-(triflu...)
Show SMILES CS(=O)(=O)N1CCc2c(C1)c(nn2CC(O)CN1CCC(CC1)c1c[nH]c2ccc(cc12)C#N)-c1ccc(cc1)C(F)(F)F |w:14.16|
Show InChI InChI=1S/C31H33F3N6O3S/c1-44(42,43)39-13-10-29-27(19-39)30(22-3-5-23(6-4-22)31(32,33)34)37-40(29)18-24(41)17-38-11-8-21(9-12-38)26-16-36-28-7-2-20(15-35)14-25(26)28/h2-7,14,16,21,24,36,41H,8-13,17-19H2,1H3
Reactome pathway
n/an/a 21n/an/an/an/an/an/a
Johnson & Johnson Pharmaceutical Research & Development
Curated by ChEMBL
Assay Description
Inhibition of human cathepsin S
Bioorg Med Chem Lett 17: 5525-8 (2007)
Article DOI: 10.1016/j.bmcl.2007.08.038
BindingDB Entry DOI: 10.7270/Q2ST7PKK