BDBM50221409 CHEMBL96162
SMILES: [H][C@@]1(O[C@H]([C@H](O)[C@@H]1OC)n1ccc(=O)[nH]c1=O)[C@@H](O[C@H]1OC(=C[C@H](O)[C@@H]1O)C(=O)Nc1cccc(F)c1)C(N)=O
InChI Key: InChIKey=BDNIXPRMHVPKKV-KQSVRIFWSA-N
Data: 1 IC50
Activity Spreadsheet -- Enzyme Inhibition Constant Data from BindingDB
Found 1 hit for monomerid = 50221409
Trg + Lig
Ki
nM
ΔG°
kcal/mole
IC50
nM
Kd
nM
EC50/IC50
nM
koff
s-1
kon
M-1s-1
pHTemp
°C
Phospho-N-acetylmuramoyl-pentapeptide-transferase/UDP-N-acetylglucosamine--N-acetylmuramyl-(pentapeptide) pyrophosphoryl-undecaprenol N-acetylglucosamine transferase
(Escherichia coli (strain K12))
BDBM50221409
(CHEMBL96162)
Show SMILES [H][C@@]1(O[C@H]([C@H](O)[C@@H]1OC)n1ccc(=O)[nH]c1=O)[C@@H](O[C@H]1OC(=C[C@H](O)[C@@H]1O)C(=O)Nc1cccc(F)c1)C(N)=O |c:23|
Show InChI InChI=1S/C23H25FN4O11/c1-36-16-15(32)21(28-6-5-13(30)27-23(28)35)38-17(16)18(19(25)33)39-22-14(31)11(29)8-12(37-22)20(34)26-10-4-2-3-9(24)7-10/h2-8,11,14-18,21-22,29,31-32H,1H3,(H2,25,33)(H,26,34)(H,27,30,35)/t11-,14-,15+,16-,17-,18+,21+,22+/m0/s1
n/an/a 10n/an/an/an/an/an/a
Sankyo Co., Ltd.
Curated by ChEMBL
Assay Description
Inhibitory activity against translocase I
Bioorg Med Chem Lett 13: 2829-32 (2003)
BindingDB Entry DOI: 10.7270/Q2TD9WR7