BDBM50221453 (3R)-1-(8-((1H-1,2,4-triazol-1-yl)methyl)-2-(trifluoromethyl)-5,6-dihydro-[1,2,4]triazolo[1,5-a]pyrazin-7(8H)-yl)-3-amino-4-(2,4,5-trifluorophenyl)butan-1-one::CHEMBL250353
SMILES: N[C@@H](CC(=O)N1CCn2nc(nc2C1Cn1cncn1)C(F)(F)F)Cc1cc(F)c(F)cc1F
InChI Key: InChIKey=ALGBOHOONNECEK-ZRKZCGFPSA-N
Data: 4 IC50
Activity Spreadsheet -- Enzyme Inhibition Constant Data from BindingDB
Found 4 hits for monomerid = 50221453
Trg + Lig
Ki
nM
ΔG°
kcal/mole
IC50
nM
Kd
nM
EC50/IC50
nM
koff
s-1
kon
M-1s-1
pHTemp
°C
Dipeptidyl peptidase 9
(Homo sapiens (Human))
BDBM50221453
((3R)-1-(8-((1H-1,2,4-triazol-1-yl)methyl)-2-(trifl...)
Show SMILES N[C@@H](CC(=O)N1CCn2nc(nc2C1Cn1cncn1)C(F)(F)F)Cc1cc(F)c(F)cc1F |w:13.15|
Show InChI InChI=1S/C19H18F6N8O/c20-12-6-14(22)13(21)4-10(12)3-11(26)5-16(34)32-1-2-33-17(29-18(30-33)19(23,24)25)15(32)7-31-9-27-8-28-31/h4,6,8-9,11,15H,1-3,5,7,26H2/t11-,15?/m1/s1
n/an/a>1.00E+5n/an/an/an/an/an/a
Merck Research Laboratories
Curated by ChEMBL
Assay Description
Inhibition of DPP9
Bioorg Med Chem Lett 17: 5934-9 (2007)
Article DOI: 10.1016/j.bmcl.2007.07.100
BindingDB Entry DOI: 10.7270/Q20C4VH0
Dipeptidyl peptidase 2 (DPP II)
(Homo sapiens (Human))
BDBM50221453
((3R)-1-(8-((1H-1,2,4-triazol-1-yl)methyl)-2-(trifl...)
Show SMILES N[C@@H](CC(=O)N1CCn2nc(nc2C1Cn1cncn1)C(F)(F)F)Cc1cc(F)c(F)cc1F |w:13.15|
Show InChI InChI=1S/C19H18F6N8O/c20-12-6-14(22)13(21)4-10(12)3-11(26)5-16(34)32-1-2-33-17(29-18(30-33)19(23,24)25)15(32)7-31-9-27-8-28-31/h4,6,8-9,11,15H,1-3,5,7,26H2/t11-,15?/m1/s1
n/an/a 4.90E+4n/an/an/an/an/an/a
Merck Research Laboratories
Curated by ChEMBL
Assay Description
Inhibition of QPP
Bioorg Med Chem Lett 17: 5934-9 (2007)
Article DOI: 10.1016/j.bmcl.2007.07.100
BindingDB Entry DOI: 10.7270/Q20C4VH0
Dipeptidyl peptidase VIII
(Homo sapiens (Human))
BDBM50221453
((3R)-1-(8-((1H-1,2,4-triazol-1-yl)methyl)-2-(trifl...)
Show SMILES N[C@@H](CC(=O)N1CCn2nc(nc2C1Cn1cncn1)C(F)(F)F)Cc1cc(F)c(F)cc1F |w:13.15|
Show InChI InChI=1S/C19H18F6N8O/c20-12-6-14(22)13(21)4-10(12)3-11(26)5-16(34)32-1-2-33-17(29-18(30-33)19(23,24)25)15(32)7-31-9-27-8-28-31/h4,6,8-9,11,15H,1-3,5,7,26H2/t11-,15?/m1/s1
n/an/a>1.00E+5n/an/an/an/an/an/a
Merck Research Laboratories
Curated by ChEMBL
Assay Description
Inhibition of DPP8
Bioorg Med Chem Lett 17: 5934-9 (2007)
Article DOI: 10.1016/j.bmcl.2007.07.100
BindingDB Entry DOI: 10.7270/Q20C4VH0
Dipeptidyl peptidase 4
(Homo sapiens (Human))
BDBM50221453
((3R)-1-(8-((1H-1,2,4-triazol-1-yl)methyl)-2-(trifl...)
Show SMILES N[C@@H](CC(=O)N1CCn2nc(nc2C1Cn1cncn1)C(F)(F)F)Cc1cc(F)c(F)cc1F |w:13.15|
Show InChI InChI=1S/C19H18F6N8O/c20-12-6-14(22)13(21)4-10(12)3-11(26)5-16(34)32-1-2-33-17(29-18(30-33)19(23,24)25)15(32)7-31-9-27-8-28-31/h4,6,8-9,11,15H,1-3,5,7,26H2/t11-,15?/m1/s1
Reactome pathway
n/an/a 5n/an/an/an/an/an/a
Merck Research Laboratories
Curated by ChEMBL
Assay Description
Inhibition of DPP4
Bioorg Med Chem Lett 17: 5934-9 (2007)
Article DOI: 10.1016/j.bmcl.2007.07.100
BindingDB Entry DOI: 10.7270/Q20C4VH0