BDBM50221554 4-(7-(2-chloro-5-hydroxyphenyl)-5-methylbenzo[e][1,2,4]triazin-3-ylamino)benzenesulfonamide::CHEMBL249820::US8481536, 468
SMILES: Cc1cc(cc2nnc(Nc3ccc(cc3)S(N)(=O)=O)nc12)-c1cc(O)ccc1Cl
InChI Key: InChIKey=BXUFOTJKNXPVHP-UHFFFAOYSA-N
Data: 1 KI  1 IC50
Activity Spreadsheet -- Enzyme Inhibition Constant Data from BindingDB
Found 2 hits for monomerid = 50221554
Trg + Lig
Ki
nM
ΔG°
kcal/mole
IC50
nM
Kd
nM
EC50/IC50
nM
koff
s-1
kon
M-1s-1
pHTemp
°C
Tyrosine-protein kinase ABL1
(Homo sapiens (Human))
BDBM50221554
(4-(7-(2-chloro-5-hydroxyphenyl)-5-methylbenzo[e][1...)
Show SMILES Cc1cc(cc2nnc(Nc3ccc(cc3)S(N)(=O)=O)nc12)-c1cc(O)ccc1Cl
Show InChI InChI=1S/C20H16ClN5O3S/c1-11-8-12(16-10-14(27)4-7-17(16)21)9-18-19(11)24-20(26-25-18)23-13-2-5-15(6-3-13)30(22,28)29/h2-10,27H,1H3,(H2,22,28,29)(H,23,24,26)
Reactome pathway
7.70n/an/an/an/an/an/an/an/a
TargeGen, Inc.
Curated by ChEMBL
Assay Description
Inhibition of Abl
Bioorg Med Chem Lett 17: 5812-8 (2007)
Article DOI: 10.1016/j.bmcl.2007.08.043
BindingDB Entry DOI: 10.7270/Q2M32VGM
Proto-oncogene tyrosine-protein kinase Src
(Homo sapiens (Human))
BDBM50221554
(4-(7-(2-chloro-5-hydroxyphenyl)-5-methylbenzo[e][1...)
Show SMILES Cc1cc(cc2nnc(Nc3ccc(cc3)S(N)(=O)=O)nc12)-c1cc(O)ccc1Cl
Show InChI InChI=1S/C20H16ClN5O3S/c1-11-8-12(16-10-14(27)4-7-17(16)21)9-18-19(11)24-20(26-25-18)23-13-2-5-15(6-3-13)30(22,28)29/h2-10,27H,1H3,(H2,22,28,29)(H,23,24,26)
US Patent
n/an/a 70.3n/an/an/an/an/a25
TargeGen, Inc.
US Patent
Assay Description
Testing of inhibition of kinases in vitro using luciferase-based assay from KinaseGlo, Promega Corp.
US Patent US8481536 (2013)
BindingDB Entry DOI: 10.7270/Q2GB22PZ