BDBM50221555 4-chloro-3-(5-methyl-3-(4-(3-(pyrrolidin-1-yl)propylsulfonyl)phenylamino)benzo[e][1,2,4]triazin-7-yl)phenol::CHEMBL399268::US8481536, 511::US8481536, 613
SMILES: Cc1cc(cc2nnc(Nc3ccc(cc3)S(=O)(=O)CCCN3CCCC3)nc12)-c1cc(O)ccc1Cl
InChI Key: InChIKey=RCZHVXSTTOXWRM-UHFFFAOYSA-N
Data: 1 KI  2 IC50
Activity Spreadsheet -- Enzyme Inhibition Constant Data from BindingDB
Found 3 hits for monomerid = 50221555
Trg + Lig
Ki
nM
ΔG°
kcal/mole
IC50
nM
Kd
nM
EC50/IC50
nM
koff
s-1
kon
M-1s-1
pHTemp
°C
Tyrosine-protein kinase ABL1
(Homo sapiens (Human))
BDBM50221555
(4-chloro-3-(5-methyl-3-(4-(3-(pyrrolidin-1-yl)prop...)
Show SMILES Cc1cc(cc2nnc(Nc3ccc(cc3)S(=O)(=O)CCCN3CCCC3)nc12)-c1cc(O)ccc1Cl
Show InChI InChI=1S/C27H28ClN5O3S/c1-18-15-19(23-17-21(34)7-10-24(23)28)16-25-26(18)30-27(32-31-25)29-20-5-8-22(9-6-20)37(35,36)14-4-13-33-11-2-3-12-33/h5-10,15-17,34H,2-4,11-14H2,1H3,(H,29,30,32)
Reactome pathway
1.70n/an/an/an/an/an/an/an/a
TargeGen, Inc.
Curated by ChEMBL
Assay Description
Inhibition of Abl
Bioorg Med Chem Lett 17: 5812-8 (2007)
Article DOI: 10.1016/j.bmcl.2007.08.043
BindingDB Entry DOI: 10.7270/Q2M32VGM
Proto-oncogene tyrosine-protein kinase Src
(Homo sapiens (Human))
BDBM50221555
(4-chloro-3-(5-methyl-3-(4-(3-(pyrrolidin-1-yl)prop...)
Show SMILES Cc1cc(cc2nnc(Nc3ccc(cc3)S(=O)(=O)CCCN3CCCC3)nc12)-c1cc(O)ccc1Cl
Show InChI InChI=1S/C27H28ClN5O3S/c1-18-15-19(23-17-21(34)7-10-24(23)28)16-25-26(18)30-27(32-31-25)29-20-5-8-22(9-6-20)37(35,36)14-4-13-33-11-2-3-12-33/h5-10,15-17,34H,2-4,11-14H2,1H3,(H,29,30,32)
US Patent
n/an/a 5n/an/an/an/an/a25
TargeGen, Inc.
US Patent
Assay Description
Testing of inhibition of kinases in vitro using luciferase-based assay from KinaseGlo, Promega Corp.
US Patent US8481536 (2013)
BindingDB Entry DOI: 10.7270/Q2GB22PZ
Platelet-derived growth factor receptor beta
(Homo sapiens (Human))
BDBM50221555
(4-chloro-3-(5-methyl-3-(4-(3-(pyrrolidin-1-yl)prop...)
Show SMILES Cc1cc(cc2nnc(Nc3ccc(cc3)S(=O)(=O)CCCN3CCCC3)nc12)-c1cc(O)ccc1Cl
Show InChI InChI=1S/C27H28ClN5O3S/c1-18-15-19(23-17-21(34)7-10-24(23)28)16-25-26(18)30-27(32-31-25)29-20-5-8-22(9-6-20)37(35,36)14-4-13-33-11-2-3-12-33/h5-10,15-17,34H,2-4,11-14H2,1H3,(H,29,30,32)
NCI pathway
Reactome pathway
US Patent
n/an/a 2.90n/an/an/an/an/an/a
TargeGen, Inc.
US Patent
Assay Description
Testing of inhibition of kinases in vitro using luciferase-based assay from KinaseGlo, Promega Corp.
US Patent US8481536 (2013)
BindingDB Entry DOI: 10.7270/Q2GB22PZ