null
SMILES: CCN(CCCCCCNc1cc(O)c(cc1O)N=CCCCCCN(CC)Cc1cccs1)Cc1cccs1
InChI Key: InChIKey=DTCQWIOMTQJZPR-UHFFFAOYSA-N
Activity Spreadsheet -- Enzyme Inhibition Constant Data from BindingDB
Found 2 hits for monomerid = 50221930
Trg + Lig
Ki
nM
ΔG°
kcal/mole
IC50
nM
Kd
nM
EC50/IC50
nM
koff
s-1
kon
M-1s-1
pHTemp
°C
Cholinesterase
(Homo sapiens (Human))
BDBM50221930
(2,5-bis{6-[ethyl(thiophen-2-ylmethyl)amino]hexylam...)
Show SMILES CCN(CCCCCCNc1cc(O)c(cc1O)N=CCCCCCN(CC)Cc1cccs1)Cc1cccs1 |w:18.18|
Show InChI InChI=1S/C32H48N4O2S2/c1-3-35(25-27-15-13-21-39-27)19-11-7-5-9-17-33-29-23-32(38)30(24-31(29)37)34-18-10-6-8-12-20-36(4-2)26-28-16-14-22-40-28/h13-17,21-24,34,37-38H,3-12,18-20,25-26H2,1-2H3
Reactome pathway
n/an/a 2.79E+3n/an/an/an/an/an/a
University of Bologna
Curated by ChEMBL
Assay Description
Inhibition of human recombinant butyrylcholinesterase
J Med Chem 50: 4882-97 (2007)
Article DOI: 10.1021/jm070559a
BindingDB Entry DOI: 10.7270/Q218379R
Acetylcholinesterase
(Homo sapiens (Human))
BDBM50221930
(2,5-bis{6-[ethyl(thiophen-2-ylmethyl)amino]hexylam...)
Show SMILES CCN(CCCCCCNc1cc(O)c(cc1O)N=CCCCCCN(CC)Cc1cccs1)Cc1cccs1 |w:18.18|
Show InChI InChI=1S/C32H48N4O2S2/c1-3-35(25-27-15-13-21-39-27)19-11-7-5-9-17-33-29-23-32(38)30(24-31(29)37)34-18-10-6-8-12-20-36(4-2)26-28-16-14-22-40-28/h13-17,21-24,34,37-38H,3-12,18-20,25-26H2,1-2H3
NCI pathway
Reactome pathway
n/an/a 60n/an/an/an/an/an/a
University of Bologna
Curated by ChEMBL
Assay Description
Inhibition of human recombinant acetylcholinesterase
J Med Chem 50: 4882-97 (2007)
Article DOI: 10.1021/jm070559a
BindingDB Entry DOI: 10.7270/Q218379R