BDBM50221938 CHEMBL321253
SMILES: CCNC(=O)C(=O)CCCCCCOc1ccc(cc1)-c1ccccc1
InChI Key: InChIKey=MWIWLUQGNHOJFD-UHFFFAOYSA-N
Data: 1 IC50
Activity Spreadsheet -- Enzyme Inhibition Constant Data from BindingDB
Found 1 hit for monomerid = 50221938
Trg + Lig
Ki
nM
ΔG°
kcal/mole
IC50
nM
Kd
nM
EC50/IC50
nM
koff
s-1
kon
M-1s-1
pHTemp
°C
Histone deacetylase (HDAC1 and HDAC2)
(Homo sapiens (Human))
BDBM50221938
(CHEMBL321253)
Show SMILES CCNC(=O)C(=O)CCCCCCOc1ccc(cc1)-c1ccccc1
Show InChI InChI=1S/C22H27NO3/c1-2-23-22(25)21(24)12-8-3-4-9-17-26-20-15-13-19(14-16-20)18-10-6-5-7-11-18/h5-7,10-11,13-16H,2-4,8-9,12,17H2,1H3,(H,23,25)
n/an/a 4.90n/an/an/an/an/an/a
Abbott Laboratories
Curated by ChEMBL
Assay Description
Inhibitory activity against mixture of histone deacetylase 1 (HDAC1) and histone deacetylase 2 (HDAC2) from nuclear extraction of K562 erythroleukemi...
Bioorg Med Chem Lett 13: 3331-5 (2003)
BindingDB Entry DOI: 10.7270/Q2MG7RQ6