BDBM50222026 (1R,3aR,4aS,8aS,9S,9aS)-9-[(E)-2-[5-(2-chlorophenyl)-2-pyridinyl]ethenyl]-decahydro-1-methyl-3H-furo[3,4-g][2]benzopyran-3-one::CHEMBL244294
SMILES: C[C@H]1OC(=O)[C@@H]2C[C@@H]3COCC[C@H]3[C@H](\C=C\c3ccc(cn3)-c3ccccc3Cl)[C@H]12
InChI Key: InChIKey=KRERNLAFZQQVRG-CEBWBDALSA-N
Data: 1 IC50
Activity Spreadsheet -- Enzyme Inhibition Constant Data from BindingDB
Found 1 hit for monomerid = 50222026
Trg + Lig
Ki
nM
ΔG°
kcal/mole
IC50
nM
Kd
nM
EC50/IC50
nM
koff
s-1
kon
M-1s-1
pHTemp
°C
Proteinase-activated receptor 1
(Homo sapiens (Human))
BDBM50222026
((1R,3aR,4aS,8aS,9S,9aS)-9-[(E)-2-[5-(2-chloropheny...)
Show SMILES C[C@H]1OC(=O)[C@@H]2C[C@@H]3COCC[C@H]3[C@H](\C=C\c3ccc(cn3)-c3ccccc3Cl)[C@H]12
Show InChI InChI=1S/C25H26ClNO3/c1-15-24-21(19-10-11-29-14-17(19)12-22(24)25(28)30-15)9-8-18-7-6-16(13-27-18)20-4-2-3-5-23(20)26/h2-9,13,15,17,19,21-22,24H,10-12,14H2,1H3/b9-8+/t15-,17-,19-,21+,22-,24+/m1/s1
n/an/a 13n/an/an/an/an/an/a
Schering-Plough Research Institute
Curated by ChEMBL
Assay Description
Displacement of [3H]haTRAP from PAR1 in human platelet membrane
J Med Chem 50: 5147-60 (2007)
Article DOI: 10.1021/jm070704k
BindingDB Entry DOI: 10.7270/Q2SN08PK