BDBM50222087 (3S,10'S,11'S,15'S,17'R)-17'-(3-fluoro-4-methoxyphenyl)-5,15'-dimethyl-2-methylidene-2H-spiro[1,4-oxazole-3,14'-tetracyclo[8.7.0.0^{2,7}.0^{11,15}]heptadecane]-1',6'-dien-5'-one::CHEMBL401267
SMILES: COc1ccc(cc1F)[C@H]1C[C@@]2(C)[C@@H](CC[C@]22N=C(C)OC2=C)[C@@H]2CCC3=CC(=O)CCC3=C12
InChI Key: InChIKey=DVIBYGTZNAJRGB-IOQHNNRJSA-N
Data: 2 IC50
Activity Spreadsheet -- Enzyme Inhibition Constant Data from BindingDB
Found 2 hits for monomerid = 50222087
Trg + Lig
Ki
nM
ΔG°
kcal/mole
IC50
nM
Kd
nM
EC50/IC50
nM
koff
s-1
kon
M-1s-1
pHTemp
°C
Glucocorticoid receptor
(Homo sapiens (Human))
BDBM50222087
((3S,10'S,11'S,15'S,17'R)-17'-(3-fluoro-4-methoxyph...)
Show SMILES COc1ccc(cc1F)[C@H]1C[C@@]2(C)[C@@H](CC[C@]22N=C(C)OC2=C)[C@@H]2CCC3=CC(=O)CCC3=C12 |t:19,29,36|
Show InChI InChI=1S/C29H32FNO3/c1-16-29(31-17(2)34-16)12-11-24-22-8-5-18-13-20(32)7-9-21(18)27(22)23(15-28(24,29)3)19-6-10-26(33-4)25(30)14-19/h6,10,13-14,22-24H,1,5,7-9,11-12,15H2,2-4H3/t22-,23+,24-,28-,29+/m0/s1
n/an/a 660n/an/an/an/an/an/a
RTI International
Curated by ChEMBL
Assay Description
Antagonist activity at glucocorticoid receptor expressed in A549 cells assessed as inhibition of corticoid-induced gene transcription by luciferase r...
Bioorg Med Chem Lett 17: 5754-7 (2007)
Article DOI: 10.1016/j.bmcl.2007.08.064
BindingDB Entry DOI: 10.7270/Q2Z03905
Progesterone receptor
(Homo sapiens (Human))
BDBM50222087
((3S,10'S,11'S,15'S,17'R)-17'-(3-fluoro-4-methoxyph...)
Show SMILES COc1ccc(cc1F)[C@H]1C[C@@]2(C)[C@@H](CC[C@]22N=C(C)OC2=C)[C@@H]2CCC3=CC(=O)CCC3=C12 |t:19,29,36|
Show InChI InChI=1S/C29H32FNO3/c1-16-29(31-17(2)34-16)12-11-24-22-8-5-18-13-20(32)7-9-21(18)27(22)23(15-28(24,29)3)19-6-10-26(33-4)25(30)14-19/h6,10,13-14,22-24H,1,5,7-9,11-12,15H2,2-4H3/t22-,23+,24-,28-,29+/m0/s1
n/an/a 4.60n/an/an/an/an/an/a
RTI International
Curated by ChEMBL
Assay Description
Antagonist activity at progesterone receptor expressed in human T47D cells assessed as inhibition of promegestone-induced alkaline phosphatase activi...
Bioorg Med Chem Lett 17: 5754-7 (2007)
Article DOI: 10.1016/j.bmcl.2007.08.064
BindingDB Entry DOI: 10.7270/Q2Z03905