BDBM50222088 (3S,10'S,11'S,15'S,17'R)-5-ethyl-17'-(3-fluoro-4-methoxyphenyl)-15'-methyl-2-methylidene-2H-spiro[1,4-oxazole-3,14'-tetracyclo[8.7.0.0^{2,7}.0^{11,15}]heptadecane]-1',6'-dien-5'-one::CHEMBL249426
SMILES: CCC1=N[C@]2(CC[C@H]3[C@@H]4CCC5=CC(=O)CCC5=C4[C@H](C[C@]23C)c2ccc(OC)c(F)c2)C(=C)O1
InChI Key: InChIKey=ZPVXFZZEEBNOSH-YVAAILABSA-N
Data: 2 IC50
Activity Spreadsheet -- Enzyme Inhibition Constant Data from BindingDB
Found 2 hits for monomerid = 50222088
Trg + Lig
Ki
nM
ΔG°
kcal/mole
IC50
nM
Kd
nM
EC50/IC50
nM
koff
s-1
kon
M-1s-1
pHTemp
°C
Glucocorticoid receptor
(Homo sapiens (Human))
BDBM50222088
((3S,10'S,11'S,15'S,17'R)-5-ethyl-17'-(3-fluoro-4-m...)
Show SMILES CCC1=N[C@]2(CC[C@H]3[C@@H]4CCC5=CC(=O)CCC5=C4[C@H](C[C@]23C)c2ccc(OC)c(F)c2)C(=C)O1 |c:18,t:2,11|
Show InChI InChI=1S/C30H34FNO3/c1-5-27-32-30(17(2)35-27)13-12-24-22-9-6-18-14-20(33)8-10-21(18)28(22)23(16-29(24,30)3)19-7-11-26(34-4)25(31)15-19/h7,11,14-15,22-24H,2,5-6,8-10,12-13,16H2,1,3-4H3/t22-,23+,24-,29-,30+/m0/s1
n/an/a>1.00E+4n/an/an/an/an/an/a
RTI International
Curated by ChEMBL
Assay Description
Antagonist activity at glucocorticoid receptor expressed in A549 cells assessed as inhibition of corticoid-induced gene transcription by luciferase r...
Bioorg Med Chem Lett 17: 5754-7 (2007)
Article DOI: 10.1016/j.bmcl.2007.08.064
BindingDB Entry DOI: 10.7270/Q2Z03905
Progesterone receptor
(Homo sapiens (Human))
BDBM50222088
((3S,10'S,11'S,15'S,17'R)-5-ethyl-17'-(3-fluoro-4-m...)
Show SMILES CCC1=N[C@]2(CC[C@H]3[C@@H]4CCC5=CC(=O)CCC5=C4[C@H](C[C@]23C)c2ccc(OC)c(F)c2)C(=C)O1 |c:18,t:2,11|
Show InChI InChI=1S/C30H34FNO3/c1-5-27-32-30(17(2)35-27)13-12-24-22-9-6-18-14-20(33)8-10-21(18)28(22)23(16-29(24,30)3)19-7-11-26(34-4)25(31)15-19/h7,11,14-15,22-24H,2,5-6,8-10,12-13,16H2,1,3-4H3/t22-,23+,24-,29-,30+/m0/s1
n/an/a 1n/an/an/an/an/an/a
RTI International
Curated by ChEMBL
Assay Description
Antagonist activity at progesterone receptor expressed in human T47D cells assessed as inhibition of promegestone-induced alkaline phosphatase activi...
Bioorg Med Chem Lett 17: 5754-7 (2007)
Article DOI: 10.1016/j.bmcl.2007.08.064
BindingDB Entry DOI: 10.7270/Q2Z03905