BDBM50222146 (S)-4-(5-(1-(2-amino-2-methylpropanamido)-2-(benzyloxy)ethyl)-1H-tetrazol-1-yl)-N-butylbutanamide::CHEMBL236311
SMILES: CCCCNC(=O)CCCn1nnnc1[C@@H](COCc1ccccc1)NC(=O)C(C)(C)N
InChI Key: InChIKey=RDULDLLMMGAAME-GOSISDBHSA-N
Data: 1 KI  2 EC50
Activity Spreadsheet -- Enzyme Inhibition Constant Data from BindingDB
Found 3 hits for monomerid = 50222146
Trg + Lig
Ki
nM
ΔG°
kcal/mole
IC50
nM
Kd
nM
EC50/IC50
nM
koff
s-1
kon
M-1s-1
pHTemp
°C
Ghrelin receptor
(Homo sapiens (Human))
BDBM50222146
((S)-4-(5-(1-(2-amino-2-methylpropanamido)-2-(benzy...)
Show SMILES CCCCNC(=O)CCCn1nnnc1[C@@H](COCc1ccccc1)NC(=O)C(C)(C)N
Show InChI InChI=1S/C22H35N7O3/c1-4-5-13-24-19(30)12-9-14-29-20(26-27-28-29)18(25-21(31)22(2,3)23)16-32-15-17-10-7-6-8-11-17/h6-8,10-11,18H,4-5,9,12-16,23H2,1-3H3,(H,24,30)(H,25,31)/t18-/m1/s1
Reactome pathway
1.78E+3n/an/an/an/an/an/an/an/a
Bristol-Myers Squibb Pharmaceutical Research Institute
Curated by ChEMBL
Assay Description
Displacement of [125I]Ghrelin from human GHSR1a after 1 hr
Bioorg Med Chem Lett 17: 5928-33 (2007)
Article DOI: 10.1016/j.bmcl.2007.07.099
BindingDB Entry DOI: 10.7270/Q28P607D
Ghrelin receptor
(Homo sapiens (Human))
BDBM50222146
((S)-4-(5-(1-(2-amino-2-methylpropanamido)-2-(benzy...)
Show SMILES CCCCNC(=O)CCCn1nnnc1[C@@H](COCc1ccccc1)NC(=O)C(C)(C)N
Show InChI InChI=1S/C22H35N7O3/c1-4-5-13-24-19(30)12-9-14-29-20(26-27-28-29)18(25-21(31)22(2,3)23)16-32-15-17-10-7-6-8-11-17/h6-8,10-11,18H,4-5,9,12-16,23H2,1-3H3,(H,24,30)(H,25,31)/t18-/m1/s1
Reactome pathway
n/an/an/an/a 30n/an/an/an/a
Bristol-Myers Squibb Research and Development
Curated by ChEMBL
Assay Description
Agonist activity at human GHS receptor expressed in H4 cells by FLIPR assay
Bioorg Med Chem Lett 18: 2536-9 (2008)
Article DOI: 10.1016/j.bmcl.2008.03.059
BindingDB Entry DOI: 10.7270/Q2T43V0X
Ghrelin receptor
(Homo sapiens (Human))
BDBM50222146
((S)-4-(5-(1-(2-amino-2-methylpropanamido)-2-(benzy...)
Show SMILES CCCCNC(=O)CCCn1nnnc1[C@@H](COCc1ccccc1)NC(=O)C(C)(C)N
Show InChI InChI=1S/C22H35N7O3/c1-4-5-13-24-19(30)12-9-14-29-20(26-27-28-29)18(25-21(31)22(2,3)23)16-32-15-17-10-7-6-8-11-17/h6-8,10-11,18H,4-5,9,12-16,23H2,1-3H3,(H,24,30)(H,25,31)/t18-/m1/s1
Reactome pathway
n/an/an/an/a 30n/an/an/an/a
Bristol-Myers Squibb Pharmaceutical Research Institute
Curated by ChEMBL
Assay Description
Agonist activity at human GHS receptor expressed in H4 glioma cells assessed as intracellular calcium concentration by FLIPR assay
Bioorg Med Chem Lett 17: 5928-33 (2007)
Article DOI: 10.1016/j.bmcl.2007.07.099
BindingDB Entry DOI: 10.7270/Q28P607D