BDBM50222147 (S)-benzyl 5-(5-(1-(2-amino-2-methylpropanamido)-2-(benzyloxy)ethyl)-1H-tetrazol-1-yl)pentylcarbamate::CHEMBL237926
SMILES: CC(C)(N)C(=O)N[C@H](COCc1ccccc1)c1nnnn1CCCCCNC(=O)OCc1ccccc1
InChI Key: InChIKey=ADRLGDSTSUIHQI-HSZRJFAPSA-N
Data: 1 KI  1 EC50
Activity Spreadsheet -- Enzyme Inhibition Constant Data from BindingDB
Found 2 hits for monomerid = 50222147
Trg + Lig
Ki
nM
ΔG°
kcal/mole
IC50
nM
Kd
nM
EC50/IC50
nM
koff
s-1
kon
M-1s-1
pHTemp
°C
Ghrelin receptor
(Homo sapiens (Human))
BDBM50222147
((S)-benzyl 5-(5-(1-(2-amino-2-methylpropanamido)-2...)
Show SMILES CC(C)(N)C(=O)N[C@H](COCc1ccccc1)c1nnnn1CCCCCNC(=O)OCc1ccccc1
Show InChI InChI=1S/C27H37N7O4/c1-27(2,28)25(35)30-23(20-37-18-21-12-6-3-7-13-21)24-31-32-33-34(24)17-11-5-10-16-29-26(36)38-19-22-14-8-4-9-15-22/h3-4,6-9,12-15,23H,5,10-11,16-20,28H2,1-2H3,(H,29,36)(H,30,35)/t23-/m1/s1
Reactome pathway
320n/an/an/an/an/an/an/an/a
Bristol-Myers Squibb Pharmaceutical Research Institute
Curated by ChEMBL
Assay Description
Displacement of [125I]Ghrelin from human GHSR1a after 1 hr
Bioorg Med Chem Lett 17: 5928-33 (2007)
Article DOI: 10.1016/j.bmcl.2007.07.099
BindingDB Entry DOI: 10.7270/Q28P607D
Ghrelin receptor
(Homo sapiens (Human))
BDBM50222147
((S)-benzyl 5-(5-(1-(2-amino-2-methylpropanamido)-2...)
Show SMILES CC(C)(N)C(=O)N[C@H](COCc1ccccc1)c1nnnn1CCCCCNC(=O)OCc1ccccc1
Show InChI InChI=1S/C27H37N7O4/c1-27(2,28)25(35)30-23(20-37-18-21-12-6-3-7-13-21)24-31-32-33-34(24)17-11-5-10-16-29-26(36)38-19-22-14-8-4-9-15-22/h3-4,6-9,12-15,23H,5,10-11,16-20,28H2,1-2H3,(H,29,36)(H,30,35)/t23-/m1/s1
Reactome pathway
n/an/an/an/a 10n/an/an/an/a
Bristol-Myers Squibb Pharmaceutical Research Institute
Curated by ChEMBL
Assay Description
Agonist activity at human GHS receptor expressed in H4 glioma cells assessed as intracellular calcium concentration by FLIPR assay
Bioorg Med Chem Lett 17: 5928-33 (2007)
Article DOI: 10.1016/j.bmcl.2007.07.099
BindingDB Entry DOI: 10.7270/Q28P607D