BDBM50222319 CHEMBL340835
SMILES: ONC(=O)CCCCCCc1nc(cs1)-c1ccc(Br)cc1
InChI Key: InChIKey=WWVJZJRNNPNVSW-UHFFFAOYSA-N
Data: 1 IC50
Activity Spreadsheet -- Enzyme Inhibition Constant Data from BindingDB
Found 1 hit for monomerid = 50222319
Trg + Lig
Ki
nM
ΔG°
kcal/mole
IC50
nM
Kd
nM
EC50/IC50
nM
koff
s-1
kon
M-1s-1
pHTemp
°C
Histone deacetylase 1/2
(Homo sapiens (Human))
BDBM50222319
(CHEMBL340835)
Show SMILES ONC(=O)CCCCCCc1nc(cs1)-c1ccc(Br)cc1
Show InChI InChI=1S/C16H19BrN2O2S/c17-13-9-7-12(8-10-13)14-11-22-16(18-14)6-4-2-1-3-5-15(20)19-21/h7-11,21H,1-6H2,(H,19,20)
n/an/a 8.5n/an/an/an/an/an/a
Abbott Laboratories
Curated by ChEMBL
Assay Description
Inhibitory activity against histone deacetylase (HDAC1 and HDAC2) isolated from K562 erythroleukemia cells
Bioorg Med Chem Lett 13: 3817-20 (2003)
BindingDB Entry DOI: 10.7270/Q23F4RVV