BDBM50222419 4-biphenyl-2-ylethynyl-6,7-dimethoxy-quinazoline::CHEMBL250924
SMILES: COc1cc2ncnc(C#Cc3ccccc3-c3ccccc3)c2cc1OC
InChI Key: InChIKey=ZUBUFJOEYHKFCQ-UHFFFAOYSA-N
Data: 1 IC50
Activity Spreadsheet -- Enzyme Inhibition Constant Data from BindingDB
Found 1 hit for monomerid = 50222419
Trg + Lig
Ki
nM
ΔG°
kcal/mole
IC50
nM
Kd
nM
EC50/IC50
nM
koff
s-1
kon
M-1s-1
pHTemp
°C
Epidermal growth factor receptor
(Homo sapiens (Human))
BDBM50222419
(4-biphenyl-2-ylethynyl-6,7-dimethoxy-quinazoline |...)
Show SMILES COc1cc2ncnc(C#Cc3ccccc3-c3ccccc3)c2cc1OC
Show InChI InChI=1S/C24H18N2O2/c1-27-23-14-20-21(25-16-26-22(20)15-24(23)28-2)13-12-18-10-6-7-11-19(18)17-8-4-3-5-9-17/h3-11,14-16H,1-2H3
n/an/a 26n/an/an/an/an/an/a
Mitsubishi Pharma Corporation
Curated by ChEMBL
Assay Description
Inhibition of partially purified EGFR tyrosine kinase from human A431 cells
Bioorg Med Chem Lett 17: 5863-7 (2007)
Article DOI: 10.1016/j.bmcl.2007.08.020
BindingDB Entry DOI: 10.7270/Q2H70FJ7