BDBM50222432 6,7-dimethoxy-4-(3-phenoxyprop-1-ynyl)quinazoline::CHEMBL250523
SMILES: COc1cc2ncnc(C#CCOc3ccccc3)c2cc1OC
InChI Key: InChIKey=SKJFTWBCHDIBAC-UHFFFAOYSA-N
Data: 1 IC50
Activity Spreadsheet -- Enzyme Inhibition Constant Data from BindingDB
Found 1 hit for monomerid = 50222432
Trg + Lig
Ki
nM
ΔG°
kcal/mole
IC50
nM
Kd
nM
EC50/IC50
nM
koff
s-1
kon
M-1s-1
pHTemp
°C
Epidermal growth factor receptor
(Homo sapiens (Human))
BDBM50222432
(6,7-dimethoxy-4-(3-phenoxyprop-1-ynyl)quinazoline ...)
Show SMILES COc1cc2ncnc(C#CCOc3ccccc3)c2cc1OC
Show InChI InChI=1S/C19H16N2O3/c1-22-18-11-15-16(20-13-21-17(15)12-19(18)23-2)9-6-10-24-14-7-4-3-5-8-14/h3-5,7-8,11-13H,10H2,1-2H3
n/an/a 15n/an/an/an/an/an/a
Mitsubishi Pharma Corporation
Curated by ChEMBL
Assay Description
Inhibition of partially purified EGFR tyrosine kinase from human A431 cells
Bioorg Med Chem Lett 17: 5863-7 (2007)
Article DOI: 10.1016/j.bmcl.2007.08.020
BindingDB Entry DOI: 10.7270/Q2H70FJ7