BDBM50222470 (3R)-3-amino-1-(4-benzyl-1-methyl-2-(trifluoromethyl)-6,7-dihydro-1H-imidazo[4,5-c]pyridin-5(4H)-yl)-4-(2,4,5-trifluorophenyl)butan-1-one::CHEMBL250284
SMILES: Cn1c2CCN(C(Cc3ccccc3)c2nc1C(F)(F)F)C(=O)C[C@H](N)Cc1cc(F)c(F)cc1F
InChI Key: InChIKey=WPHMUXWMCFNMCS-UJONTBEJSA-N
Data: 8 IC50
Activity Spreadsheet -- Enzyme Inhibition Constant Data from BindingDB
Found 8 hits for monomerid = 50222470
Trg + Lig
Ki
nM
ΔG°
kcal/mole
IC50
nM
Kd
nM
EC50/IC50
nM
koff
s-1
kon
M-1s-1
pHTemp
°C
Dipeptidyl peptidase 4
(Homo sapiens (Human))
BDBM50222470
((3R)-3-amino-1-(4-benzyl-1-methyl-2-(trifluorometh...)
Show SMILES Cn1c2CCN(C(Cc3ccccc3)c2nc1C(F)(F)F)C(=O)C[C@H](N)Cc1cc(F)c(F)cc1F |w:6.6|
Show InChI InChI=1S/C25H24F6N4O/c1-34-20-7-8-35(22(36)12-16(32)10-15-11-18(27)19(28)13-17(15)26)21(9-14-5-3-2-4-6-14)23(20)33-24(34)25(29,30)31/h2-6,11,13,16,21H,7-10,12,32H2,1H3/t16-,21?/m1/s1
Reactome pathway
n/an/a 570n/an/an/an/an/an/a
Merck Research Laboratories
Curated by ChEMBL
Assay Description
Inhibition of DPP4
Bioorg Med Chem Lett 17: 5853-7 (2007)
Article DOI: 10.1016/j.bmcl.2007.08.030
BindingDB Entry DOI: 10.7270/Q2T72J8F
Dipeptidyl peptidase VIII
(Homo sapiens (Human))
BDBM50222470
((3R)-3-amino-1-(4-benzyl-1-methyl-2-(trifluorometh...)
Show SMILES Cn1c2CCN(C(Cc3ccccc3)c2nc1C(F)(F)F)C(=O)C[C@H](N)Cc1cc(F)c(F)cc1F |w:6.6|
Show InChI InChI=1S/C25H24F6N4O/c1-34-20-7-8-35(22(36)12-16(32)10-15-11-18(27)19(28)13-17(15)26)21(9-14-5-3-2-4-6-14)23(20)33-24(34)25(29,30)31/h2-6,11,13,16,21H,7-10,12,32H2,1H3/t16-,21?/m1/s1
n/an/a 7.00E+4n/an/an/an/an/an/a
Merck Research Laboratories
Curated by ChEMBL
Assay Description
Inhibition of DPP8
Bioorg Med Chem Lett 17: 5853-7 (2007)
Article DOI: 10.1016/j.bmcl.2007.08.030
BindingDB Entry DOI: 10.7270/Q2T72J8F
Dipeptidyl peptidase VIII
(Homo sapiens (Human))
BDBM50222470
((3R)-3-amino-1-(4-benzyl-1-methyl-2-(trifluorometh...)
Show SMILES Cn1c2CCN(C(Cc3ccccc3)c2nc1C(F)(F)F)C(=O)C[C@H](N)Cc1cc(F)c(F)cc1F |w:6.6|
Show InChI InChI=1S/C25H24F6N4O/c1-34-20-7-8-35(22(36)12-16(32)10-15-11-18(27)19(28)13-17(15)26)21(9-14-5-3-2-4-6-14)23(20)33-24(34)25(29,30)31/h2-6,11,13,16,21H,7-10,12,32H2,1H3/t16-,21?/m1/s1
n/an/a 1.00E+5n/an/an/an/an/an/a
Merck Research Laboratories
Curated by ChEMBL
Assay Description
Inhibition of DPP8
Bioorg Med Chem Lett 17: 5853-7 (2007)
Article DOI: 10.1016/j.bmcl.2007.08.030
BindingDB Entry DOI: 10.7270/Q2T72J8F
Dipeptidyl peptidase 4
(Homo sapiens (Human))
BDBM50222470
((3R)-3-amino-1-(4-benzyl-1-methyl-2-(trifluorometh...)
Show SMILES Cn1c2CCN(C(Cc3ccccc3)c2nc1C(F)(F)F)C(=O)C[C@H](N)Cc1cc(F)c(F)cc1F |w:6.6|
Show InChI InChI=1S/C25H24F6N4O/c1-34-20-7-8-35(22(36)12-16(32)10-15-11-18(27)19(28)13-17(15)26)21(9-14-5-3-2-4-6-14)23(20)33-24(34)25(29,30)31/h2-6,11,13,16,21H,7-10,12,32H2,1H3/t16-,21?/m1/s1
Reactome pathway
n/an/a 8.40n/an/an/an/an/an/a
Merck Research Laboratories
Curated by ChEMBL
Assay Description
Inhibition of DPP4
Bioorg Med Chem Lett 17: 5853-7 (2007)
Article DOI: 10.1016/j.bmcl.2007.08.030
BindingDB Entry DOI: 10.7270/Q2T72J8F
Dipeptidyl peptidase 9
(Homo sapiens (Human))
BDBM50222470
((3R)-3-amino-1-(4-benzyl-1-methyl-2-(trifluorometh...)
Show SMILES Cn1c2CCN(C(Cc3ccccc3)c2nc1C(F)(F)F)C(=O)C[C@H](N)Cc1cc(F)c(F)cc1F |w:6.6|
Show InChI InChI=1S/C25H24F6N4O/c1-34-20-7-8-35(22(36)12-16(32)10-15-11-18(27)19(28)13-17(15)26)21(9-14-5-3-2-4-6-14)23(20)33-24(34)25(29,30)31/h2-6,11,13,16,21H,7-10,12,32H2,1H3/t16-,21?/m1/s1
n/an/a>1.00E+5n/an/an/an/an/an/a
Merck Research Laboratories
Curated by ChEMBL
Assay Description
Inhibition of DPP9
Bioorg Med Chem Lett 17: 5853-7 (2007)
Article DOI: 10.1016/j.bmcl.2007.08.030
BindingDB Entry DOI: 10.7270/Q2T72J8F
Dipeptidyl peptidase 2 (DPP II)
(Homo sapiens (Human))
BDBM50222470
((3R)-3-amino-1-(4-benzyl-1-methyl-2-(trifluorometh...)
Show SMILES Cn1c2CCN(C(Cc3ccccc3)c2nc1C(F)(F)F)C(=O)C[C@H](N)Cc1cc(F)c(F)cc1F |w:6.6|
Show InChI InChI=1S/C25H24F6N4O/c1-34-20-7-8-35(22(36)12-16(32)10-15-11-18(27)19(28)13-17(15)26)21(9-14-5-3-2-4-6-14)23(20)33-24(34)25(29,30)31/h2-6,11,13,16,21H,7-10,12,32H2,1H3/t16-,21?/m1/s1
n/an/a 2.00E+4n/an/an/an/an/an/a
Merck Research Laboratories
Curated by ChEMBL
Assay Description
Inhibition of QPP
Bioorg Med Chem Lett 17: 5853-7 (2007)
Article DOI: 10.1016/j.bmcl.2007.08.030
BindingDB Entry DOI: 10.7270/Q2T72J8F
Dipeptidyl peptidase 9
(Homo sapiens (Human))
BDBM50222470
((3R)-3-amino-1-(4-benzyl-1-methyl-2-(trifluorometh...)
Show SMILES Cn1c2CCN(C(Cc3ccccc3)c2nc1C(F)(F)F)C(=O)C[C@H](N)Cc1cc(F)c(F)cc1F |w:6.6|
Show InChI InChI=1S/C25H24F6N4O/c1-34-20-7-8-35(22(36)12-16(32)10-15-11-18(27)19(28)13-17(15)26)21(9-14-5-3-2-4-6-14)23(20)33-24(34)25(29,30)31/h2-6,11,13,16,21H,7-10,12,32H2,1H3/t16-,21?/m1/s1
n/an/a>1.00E+5n/an/an/an/an/an/a
Merck Research Laboratories
Curated by ChEMBL
Assay Description
Inhibition of DPP9
Bioorg Med Chem Lett 17: 5853-7 (2007)
Article DOI: 10.1016/j.bmcl.2007.08.030
BindingDB Entry DOI: 10.7270/Q2T72J8F
Dipeptidyl peptidase 2 (DPP II)
(Homo sapiens (Human))
BDBM50222470
((3R)-3-amino-1-(4-benzyl-1-methyl-2-(trifluorometh...)
Show SMILES Cn1c2CCN(C(Cc3ccccc3)c2nc1C(F)(F)F)C(=O)C[C@H](N)Cc1cc(F)c(F)cc1F |w:6.6|
Show InChI InChI=1S/C25H24F6N4O/c1-34-20-7-8-35(22(36)12-16(32)10-15-11-18(27)19(28)13-17(15)26)21(9-14-5-3-2-4-6-14)23(20)33-24(34)25(29,30)31/h2-6,11,13,16,21H,7-10,12,32H2,1H3/t16-,21?/m1/s1
n/an/a 4.60E+4n/an/an/an/an/an/a
Merck Research Laboratories
Curated by ChEMBL
Assay Description
Inhibition of QPP
Bioorg Med Chem Lett 17: 5853-7 (2007)
Article DOI: 10.1016/j.bmcl.2007.08.030
BindingDB Entry DOI: 10.7270/Q2T72J8F