BDBM50222657 4-bromo-5-[(2-chlorobenzoyl)amino]-N-phenyl-1H-pyrazole-3-carboxamide::CHEMBL397037
SMILES: Clc1ccccc1C(=O)Nc1[nH]nc(C(=O)Nc2ccccc2)c1Br
InChI Key: InChIKey=IUFFQTTYQLZJMY-UHFFFAOYSA-N
Data: 1 KI  1 IC50
Activity Spreadsheet -- Enzyme Inhibition Constant Data from BindingDB
Found 2 hits for monomerid = 50222657
Trg + Lig
Ki
nM
ΔG°
kcal/mole
IC50
nM
Kd
nM
EC50/IC50
nM
koff
s-1
kon
M-1s-1
pHTemp
°C
Bradykinin B1 receptor
(Homo sapiens (Human))
BDBM50222657
(4-bromo-5-[(2-chlorobenzoyl)amino]-N-phenyl-1H-pyr...)
Show SMILES Clc1ccccc1C(=O)Nc1[nH]nc(C(=O)Nc2ccccc2)c1Br
Show InChI InChI=1S/C17H12BrClN4O2/c18-13-14(17(25)20-10-6-2-1-3-7-10)22-23-15(13)21-16(24)11-8-4-5-9-12(11)19/h1-9H,(H,20,25)(H2,21,22,23,24)
200n/an/an/an/an/an/an/an/a
Elan Pharmaceuticals, Inc.
Curated by ChEMBL
Assay Description
Displacement of [3H]DAKA from human bradykinin B1 receptor in IL1beta stimulated IMR90 cells
J Med Chem 50: 5161-7 (2007)
Article DOI: 10.1021/jm051292n
BindingDB Entry DOI: 10.7270/Q2G73DF9
Bradykinin B1 receptor
(Homo sapiens (Human))
BDBM50222657
(4-bromo-5-[(2-chlorobenzoyl)amino]-N-phenyl-1H-pyr...)
Show SMILES Clc1ccccc1C(=O)Nc1[nH]nc(C(=O)Nc2ccccc2)c1Br
Show InChI InChI=1S/C17H12BrClN4O2/c18-13-14(17(25)20-10-6-2-1-3-7-10)22-23-15(13)21-16(24)11-8-4-5-9-12(11)19/h1-9H,(H,20,25)(H2,21,22,23,24)
n/an/a 530n/an/an/an/an/an/a
Elan Pharmaceuticals, Inc.
Curated by ChEMBL
Assay Description
Antagonist activity at human bradykinin B1 receptor in IL1beta stimulated IMR90 cells by FLIPR assay
J Med Chem 50: 5161-7 (2007)
Article DOI: 10.1021/jm051292n
BindingDB Entry DOI: 10.7270/Q2G73DF9